{"text_format":"1","workbook":"xlsx","n_sheets":13,"sheets":["Plan0_Definições","Plan1 ORIENTAÇÕES PREENCHIMENTO","Plan2 1.DADOS,2.OBJ e 2.1.Vigên","Plan3 2.2. QUADRO RESUMO","Plan4 2.3. OPERAÇÕES","Plan5 3. JUSTIFIC. e 4.BENEFIC.","Plan 6 5. METAS e 6.ETAPAS","Plan7 7. PLA DE APL 8 Cap Int.","Plan8 9.PREVISÃO e10 CRONOGRAM","Plan 09.11MONIT_AVALIA_P.CONTAS","Planilha10  12.DOC_INTEGR_PT ","Plan11 10. ASSINATURAS","Municipios"],"not_rendered":{"charts":0,"images":4,"macros":1,"external_links":1,"defined_names":11,"comments":2,"pivot_tables":0},"unopened":[],"bounds":{"document_bytes":16777216,"sheet_cells":100000,"rows_first":2000,"rows_last":500,"rows_between":2000,"halvings":0,"cell_chars":16384,"cell_head_chars":4096},"cells_cut":0,"cells_raw":0,"read":"whole","date_system":"1900"}

{"sheet":"Plan0_Definições","index":0,"n_rows":15,"n_cols":3,"rows_kept":15,"cut":false,"hidden":true,"merged":[[10,2,10,11],[12,2,12,11],[11,2,11,11],[13,2,13,11],[14,2,14,11],[9,2,9,11],[1,1,1,11],[3,1,3,11],[5,2,5,11],[6,2,6,11],[7,2,7,11],[8,2,8,11]]}
[]
[null,"PROGRAMA ESTRADAS DA INTEGRAÇÃO  PROJETO DE ADEQUAÇÃO, READEQUAÇÃO, MAUTENÇÃO E OU MELHORIAS DE ESTRADAS RURAIS MUNICIPAIS - CUSTEIO SOMENTE ÓLEO DIESEL COM BASE EM  RTV - Relatório Técnico de Vistoria e Projetos Técnicos"]
[]
[null,"1 . DEFINIÇÕES"]
[]
[null,"1.1","ABERTURA DE ESTRADAS RURAIS:  obra destinada a dar acesso aos lotes que estão sendo objeto de reforma agrária, permitindo assim o livre acesso dos moradores ao comércio, educação, saúde e cidadania. Utilizando –se de práticas para a Conservação de solos e consequentemente das estradas, com a construção de estruturas para captação e retenção de águas pluviais."]
[null,"1.2","ADEQUAÇÃO DE ESTRADAS RURAIS*: obras destinadas à execução de melhoramentos em estradas rurais de menor hierarquia funcional, possuindo superfície de rolamento “não pavimentada”, cujo objetivo é o de elevar seu padrão operacional. Inclui-se nessa modalidade de intervenção:\n•         Serviços de re-locação de parte de seu traçado;\n•         Re-conformação de segmentos do greide;\n•         Execução de camadas de reforço do sub-leito e/ou;\n•         Revestimento primário. \n*Fonte: Estradas rurais Técnicas Adequadas de Manutenção. Florianópolis DER, 2003. 236 p. il. 30cm.\n"]
[null,"1.3","MANUTENÇÃO DE ESTRADA RURAL: pode ser definido como amplo conjunto de atividades destinadas a assegurar um transporte seguro, econômico e confortável em uma estrada ou rede de estradas. Uma das finalidades primordiais da manutenção é evitar, ao máximo possível, a perda desnecessária do capital já investido, mediante a proteção física da estrutura básica e da superfície de rolamento da estrada. A manutenção deve evitar a deterioração precoce da estrutura das estradas e, por conseguinte, a necessidade de serviços de reconstrução. Inclui-se nessa definição, as atividades de manutenção corretiva rotineira e periódica. "]
[null,"1.4","MELHORIA DE ESTRADA RURAL: Conjunto de operações que acrescentam as rodovias (estradas) existentes características novas, sem modificar as existentes ex. colocação de bueiros, sarjeteamento, bigodes, caixas de retenção. (fonte: DNER, glossário de termos técnicos rodoviários, Rio de janeiro, 1997, 266p. IPR. Publ.; 700)."]
[null,"1.5","Trafegabilidade é uma palavra derivada de trafegável, que se pode trafegar, andar no tráfego; fazer algum caminho; andar, transitar: os pedestres precisam de cuidado ao trafegar por ruas movimentadas. (fonte: https://www.dicio.com.br)"]
{"$rows_left_out":6}
{"sheet":"Plan1 ORIENTAÇÕES PREENCHIMENTO","index":1,"n_rows":46,"n_cols":5,"rows_kept":46,"cut":false,"hidden":true,"merged":[[43,0,43,10],[52,0,52,10],[45,4,50,5],[44,0,44,10],[30,1,30,10],[31,1,31,10],[32,1,32,10],[38,1,38,10],[42,1,42,10],[41,1,41,10],[40,1,40,10],[39,1,39,10],[37,1,37,10],[33,1,33,10],[34,1,34,10],[35,1,35,10],[36,1,36,10],[20,1,20,10],[21,1,21,10],[22,1,22,10],[29,1,29,10],[24,1,24,10],[27,1,27,10],[28,1,28,10],[0,0,0,10],[23,1,23,10],[25,1,25,10],[26,1,26,10],[13,1,13,10],[1,0,1,10],[12,1,12,10],[4,1,4,10],[3,1,3,10],[7,1,7,10],[11,1,11,10],[9,0,9,10],[6,1,6,10],[5,1,5,10],[17,0,17,10],[19,1,19,10],[21,0,23,0],[26,0,27,0],[28,0,29,0],[31,0,32,0],[37,0,42,0],[34,0,36,0]]}
["PROGRAMA ESTRADAS DA INTEGRAÇÃO  PROJETO DE ADEQUAÇÃO, READEQUAÇÃO, MAUTENÇÃO E OU MELHORIAS DE ESTRADAS RURAIS MUNICIPAIS - CUSTEIO SOMENTE ÓLEO DIESEL COM BASE EM  RTV - Relatório Técnico de Vistoria e Projetos Técnicos"]
["1 . ORIENTAÇÕES PARA O PREENCHIMENTO DA PLANILHA"]
[]
["1.1","Todas as células com a cor AZUL devem ser preenchidas pelo MUNICÍPIO"]
["1.2","Todas as células preenchidas de VERDE são resultados automáticos de fórmulas e NÃO PODEM SER MODIFICADAS.\nCaso haja necessidade de incluir novas linhas na planilha é importante verificar se as fórmulas estão contemplando todas as células, conferindo o Número e Letra na fórmula ao clicar nelas. Nesse caso, excepcionalmente, deve-se fazer a correção da fórmula para anular erros (por isso as células não foram bloqueadas)."]
["1.3","A logomarca do município deve ser inserida dentro do quadro abaixo e a mesma será replicada em todas as páginas do plano de trabalho."]
["1.4","Caso a largura de alguma coluna precise ser modificada, para impressão não cortar a página, clicar em Exibir > Vizualização da Quebra de Página: arrastar a linha de quebra para contemplar toda a tabela. Depois Exibir > Normal, para voltar à visualização de planilha."]
["1.5","O valor de contrapartida municipal  é obrigatória  para todas as trasnferencias voluntárias, conforme Lei Federal- nº 14.133 e Decreto Estadual nº 10086."]
[]
["2 . ORIENTAÇÕES PARA INCLUSÃO DO PLANO DE TRABALHO NO E-PROTOCOLO"]
{"$rows_left_out":37}
{"sheet":"Plan2 1.DADOS,2.OBJ e 2.1.Vigên","index":2,"n_rows":61,"n_cols":13,"rows_kept":61,"cut":false,"hidden":false,"merged":[[39,1,39,3],[39,4,39,6],[23,4,23,5],[17,7,17,8],[17,2,17,4],[37,4,37,6],[37,1,37,3],[35,4,35,6],[29,1,29,8],[24,2,24,8],[34,1,34,3],[35,1,35,3],[34,4,34,6],[36,4,36,6],[36,1,36,3],[30,1,32,8],[41,1,41,8],[43,1,43,2],[44,1,44,2],[1,2,1,8],[26,2,26,8],[27,2,27,3],[27,5,27,8],[22,2,22,8],[23,6,23,8],[23,2,23,3],[18,2,18,8],[19,2,19,8],[21,2,21,8],[20,6,20,8],[17,5,17,6],[6,2,6,8],[7,2,7,8],[20,11,21,17],[13,2,13,8],[8,6,8,8],[8,2,8,4],[12,5,12,8],[11,2,11,8],[12,2,12,3],[9,6,9,8],[10,2,10,8]]}
[]
[null,null,"PLANO DE TRABALHO\n MELHORIA DA TRAFEGABILIDADE EM ESTRADAS RURAIS MUNICIPAIS\nÓLEO DIESEL com base no RTV - Relatório Técnico de Vistoria e Projetos Técnicos"]
[]
[null,"1. DADOS CADASTRAIS "]
[null,"1.1 DO CONCEDENTE"]
[]
[null,"Secretaria","Secretaria da Agricultura e do Abastecimento"]
[null,"CNPJ:","76.416.957/0001-85"]
[null,"Endereço:","Rua dos Funcionários nº 1559, Cabral",null,null,"Município:","Curitiba"]
[null,"UF:","PR","CEP:","80035-050","Telefone:","(41) 3313-4000"]
{"$rows_left_out":52}
{"sheet":"Plan3 2.2. QUADRO RESUMO","index":3,"n_rows":26,"n_cols":13,"rows_kept":26,"cut":false,"hidden":false,"merged":[[5,7,6,7],[26,1,26,12],[25,1,25,12],[23,1,23,5],[22,1,22,5],[1,4,1,12],[3,1,3,12],[5,1,6,1],[5,2,6,2],[1,1,1,2],[5,10,6,10],[5,12,6,12],[5,11,6,11],[5,6,6,6],[5,3,5,5],[5,9,6,9],[5,8,6,8]]}
[]
[null,null,null,null,"PLANO DE TRABALHO\n MELHORIA DA TRAFEGABILIDADE EM ESTRADAS RURAIS MUNICIPAIS\nÓLEO DIESEL com base no RTV - Relatório Técnico de Vistoria e Projetos Técnicos"]
[]
[null,"2.2. Quadro Resumo (Total das Estradas Rurais/trechos indicados nos RTV’s*)"]
[]
[null,"nº","Estrada Rural/ Nome/ Trechos","Coordenadas UTM - SAD-69",null,null,"Extensão total(m)","Extensão cascalhamento (m)","Larg. total (m)","Larg. Cascalhamento (m)","Espessura cascalho compactado (m)","Área total (m²)","Área cascalhada(m²)"]
[null,null,null,"FUSO","Início                        Lat./Long.","Término                       Lat./Long."]
[null,1,"xxx","zz","vvv","bbb",1000,1000,7,6,0.15,{"$f":"G8*I8","v":7000},{"$f":"H8*J8","v":6000}]
[null,2,null,null,null,null,null,null,null,null,null,{"$f":"G9*I9","v":0},{"$f":"H9*J9","v":0}]
[null,3,null,null,null,null,null,null,null,null,null,0,0]
{"$rows_left_out":17}
{"sheet":"Plan4 2.3. OPERAÇÕES","index":4,"n_rows":69,"n_cols":23,"rows_kept":69,"cut":false,"hidden":false,"merged":[[42,13,42,15],[42,1,42,12],[40,4,40,7],[41,4,41,7],[43,13,45,13],[43,9,45,9],[43,8,45,8],[62,2,63,2],[62,3,63,3],[61,4,61,5],[61,2,61,3],[59,1,59,18],[62,7,63,7],[62,8,62,9],[61,6,61,9],[62,4,63,4],[62,5,63,5],[62,6,63,6],[49,4,49,7],[50,4,50,7],[43,4,45,7],[46,4,46,7],[47,4,47,7],[57,1,57,12],[7,20,8,20],[2,21,2,22],[4,1,4,22],[10,1,11,1],[10,2,11,2],[10,3,11,3],[10,9,11,9],[6,9,8,9],[9,13,9,15],[7,21,7,22],[16,1,17,1],[16,3,17,3],[21,1,22,1],[8,4,8,7],[27,4,27,7],[28,4,28,7],[21,13,22,13],[26,13,26,15],[9,1,9,12],[6,12,8,12],[6,10,8,10],[6,11,8,11],[19,4,19,7],[20,4,20,7],[21,4,22,7],[23,4,23,7],[24,4,25,7],[6,1,7,3],[21,9,22,9],[24,9,25,9],[21,8,22,8],[24,8,25,8],[24,13,25,13],[21,3,22,3],[1,21,1,22],[1,18,2,18],[10,4,11,7],[12,4,12,7],[13,4,13,7],[14,4,14,7],[15,4,15,7],[16,4,17,7],[18,4,18,7],[6,4,7,7],[6,8,8,8],[6,14,8,14],[6,13,8,13],[10,13,11,13],[16,13,17,13],[6,17,6,18],[7,18,8,18],[7,17,8,17],[6,16,8,16],[6,15,8,15],[16,9,17,9],[16,8,17,8],[1,3,2,16],[6,20,6,22],[24,1,25,1],[24,3,25,3],[43,1,45,1],[43,3,45,3],[26,1,26,12],[31,4,31,7],[32,4,32,7],[33,4,33,7],[34,4,34,7],[35,4,35,7],[36,4,36,7],[29,4,29,7],[30,4,30,7],[37,4,37,7],[38,4,38,7],[39,4,39,7],[48,13,48,15],[48,1,48,12],[52,4,52,7],[53,1,53,12],[54,1,54,12],[55,4,55,7],[56,4,56,7],[51,1,51,12],[51,13,51,15],[54,13,54,15]]}
[]
[null,null,null,"PLANO DE TRABALHO\n MELHORIA DA TRAFEGABILIDADE EM ESTRADAS RURAIS MUNICIPAIS\nÓLEO DIESEL com base no RTV - Relatório Técnico de Vistoria e Projetos Técnicos",null,null,null,null,null,null,null,null,null,null,null,null,null,null,"Contrapartida:  ","Municipio","IPDM","% DA CONTRAPARTDIDA"]
[null,null,null,null,null,null,null,null,null,null,null,null,null,null,null,null,null,null,null,{"$f":"'Plan2 1.DADOS,2.OBJ e 2.1.Vigên'!C18","v":"Adrianópolis"},{"$f":"VLOOKUP(T3,Municipios!A:C,2,0)","v":0.67694205309987032},{"$f":"VALUE(VLOOKUP(U3,Municipios!B:D,2,0))","v":0.05}]
[]
[null,"2.3. Operações a serem executadas nos trechos ( * Preferencialmente utilizar como referência: Tabelas de custos SEIL/DER/PR). E excepcionalmente SINAPI E DNIT, nos casos de serviços não contemplados pela tabeLa do DER-Pr"]
[]
[null,"Tipo  Serviço:",null,null,{"$f":"'Plan2 1.DADOS,2.OBJ e 2.1.Vigên'!E35","v":"MELHORIAS"},null,null,null,"Unid.","Qtd.","Rodovia pavimentada   DMT - km","Rodovia não pavimentada    DMT - km","MÁQUINA (referência)  E OUTROS A UTILIZAR","RENDIMENTO ESPERADO  - litros de OD POR HORA","Nº DE HORAS MÁQUINAS E CAMINHÕES/outros","média de consumo                   L/ HORA","N° DE LITROS OD","CUSTO  ÓLEO DIESEL - ANP EM .../.../202...(R$) e outros custos",null,"SEAB","CONTRAPARTIDA (MUNICÍPIO)²"]
[null,null,null,null,null,null,null,null,null,null,null,null,null,null,null,null,null,"UNITÁRIO","TOTAL",null,"FINANCEIRA R$","FÍSICA"]
[null,"Nº","Natureza de despesa","Código DER PR","Itens",null,null,null,null,null,null,null,null,null,null,null,null,null,null,"R$",null,"SERVIÇOS","BENS"]
[null,"01-TERRAPLENAGEM:",null,null,null,null,null,null,null,null,null,null,null,{"$f":"CONCATENATE(\"SubTotal \",B10)","v":"SubTotal 01-TERRAPLENAGEM:"},null,null,{"$f":"SUM(Q11:Q26)","v":2748.504249543581},null,{"$f":"SUM(S11:S26)","v":13770.006290213345},{"$f":"SUM(T11:T26)","v":13081.505975702676},{"$f":"SUM(U11:U26)","v":688.50031451066718},{"$f":"SUM(V11:V26)","v":0},{"$f":"SUM(W11:W26)","v":0}]
{"$rows_left_out":60}
{"sheet":"Plan5 3. JUSTIFIC. e 4.BENEFIC.","index":5,"n_rows":32,"n_cols":7,"rows_kept":32,"cut":false,"hidden":false,"merged":[[30,1,30,3],[28,4,28,5],[30,4,30,5],[31,1,31,5],[22,1,22,3],[23,1,23,3],[24,1,24,3],[25,1,25,3],[26,1,26,3],[27,1,27,3],[28,1,28,3],[29,1,29,3],[12,1,12,3],[13,1,13,3],[14,1,14,3],[15,1,15,3],[16,1,16,3],[17,1,17,3],[18,1,18,3],[19,1,19,3],[20,1,20,3],[21,1,21,3],[1,3,1,5],[6,1,6,5],[1,1,1,2],[10,4,10,5],[10,1,11,3],[3,1,3,5]]}
[]
[null,null,null,"PLANO DE TRABALHO\n MELHORIA DA TRAFEGABILIDADE EM ESTRADAS RURAIS MUNICIPAIS\nÓLEO DIESEL com base no RTV - Relatório Técnico de Vistoria e Projetos Técnicos"]
[]
[null,"3. RAZÕES PARA CELEBRAÇÃO - JUSTIFICATIVA"]
[]
[]
[null,"1. Discorrer as razões que justificam a celebração do instrumento, caracterizando (evidenciando) e indicando, entre outras:\na) interesses recíprocos entre a Seab e o Município, e o atendimento da(s) necessidade (s) da comunidade (s) a serem benficiadas;\nb) relação entre a projeto técnico apresentado, operações a serem executadas e objetivos do plano, programa, projeto ou proposta estadual ou municipal;\nc) qualificação do público alvo;\nd) problemas a serem resolvidos; \ne) resultados esperados; \nf)  Índice Desempenho Municipal (IDM/Ipardes) ou IDH - posição do Município em relação à média do Estado, ...;\ng) VBP - Principais produtos, posição do Município em relação à média do Estado, ...;\nh) Proporção de agricultores familiares em relação ao total de produtores/agricultores do município;\ni) Famílias do meio rural abaixo da linha de pobreza e/ou inscritas no CadUnico;\nj) Estrutura fundiário do município;\nk)Outras informações relevantes.\n2. Justificar a relação entre custos e beneficios, do desembolso a ser realizado pela Administração em decorrência do convênio;\n"]
[]
[null,"4. BENEFICIÁRIOS"]
[]
{"$rows_left_out":23}
{"sheet":"Plan 6 5. METAS e 6.ETAPAS","index":6,"n_rows":32,"n_cols":11,"rows_kept":32,"cut":false,"hidden":false,"merged":[[21,2,21,3],[22,2,22,3],[23,2,23,3],[14,2,14,5],[14,6,14,8],[14,9,14,10],[31,2,31,5],[5,6,5,7],[5,8,5,10],[29,2,29,5],[28,2,28,5],[10,1,10,10],[12,2,12,5],[13,2,13,5],[16,2,16,5],[15,2,15,5],[20,2,20,5],[20,1,21,1],[18,2,18,5],[1,1,1,2],[5,1,6,1],[5,2,6,2],[5,3,6,3],[5,4,5,5],[1,3,1,10],[3,1,3,10],[31,9,31,10],[13,6,13,8],[15,6,15,8],[16,6,16,8],[17,6,17,8],[18,6,18,8],[20,6,27,8],[20,9,27,10],[31,6,31,8],[30,6,30,8],[17,9,17,10],[18,9,18,10],[13,9,13,10],[15,9,15,10],[16,9,16,10],[19,2,19,5],[19,6,19,8],[19,9,19,10],[30,2,30,5],[12,9,12,10],[28,6,28,8],[29,6,29,8],[28,9,28,10],[29,9,29,10],[30,9,30,10],[25,2,25,3],[26,2,26,3],[27,2,27,3],[24,2,24,3],[17,2,17,5],[12,6,12,8]]}
[]
[null,null,null,"PLANO DE TRABALHO\n MELHORIA DA TRAFEGABILIDADE EM ESTRADAS RURAIS MUNICIPAIS\nÓLEO DIESEL com base no RTV - Relatório Técnico de Vistoria e Projetos Técnicos"]
[]
[null,"5. DEFINIÇÃO E DETALHAMENTO DAS METAS:"]
[]
[null,"Meta","Natureza Despesa","Descrição","Duração",null,"Indicador Físico",null,"Custo (R$)"]
[null,null,null,null,"Início","Término","Área ","Unid.","Unit./m²","Unit./km","Total (R$)"]
[null,1,"4.4.90.51.00","Aquisição de serviços para a execução do objeto","A partir da Publicação no DIOE",{"$f":"CONCATENATE('Plan2 1.DADOS,2.OBJ e 2.1.Vigên'!D45,\" \",\"meses a partir da publicação no DIOE\")","v":"24 meses a partir da publicação no DIOE"},{"$f":"'Plan3 2.2. QUADRO RESUMO'!M23","v":6000},"m²",{"$f":"K8/G8","v":9.4362770083103573},{"$f":"K8/'Plan3 2.2. QUADRO RESUMO'!G23*1000","v":56617.662049862149},{"$f":"'Plan4 2.3. OPERAÇÕES'!D65","v":56617.662049862149}]
[]
[]
{"$rows_left_out":23}
{"sheet":"Plan7 7. PLA DE APL 8 Cap Int.","index":7,"n_rows":51,"n_cols":13,"rows_kept":51,"cut":false,"hidden":false,"merged":[[1,2,1,6],[6,4,6,6],[3,1,3,6],[19,1,26,1],[6,1,7,1],[6,2,6,3],[15,2,15,3],[19,2,21,2],[12,1,14,1],[19,3,19,7],[20,4,20,6],[20,7,21,7],[7,2,7,3],[8,2,8,3],[29,1,35,6],[38,1,38,7],[39,6,39,7],[39,1,39,3],[39,4,39,5],[28,1,28,6],[20,3,21,3],[12,2,12,6],[13,4,13,6],[13,2,14,3]]}
[]
[null,null,"PLANO DE TRABALHO\n MELHORIA DA TRAFEGABILIDADE EM ESTRADAS RURAIS MUNICIPAIS\nÓLEO DIESEL com base no RTV - Relatório Técnico de Vistoria e Projetos Técnicos"]
[]
[null,"7 - PLANO DE APLICAÇÃO DOS RECURSOS FINANCEIROS"]
[]
[null,"RESUMO DAS METAS",null,null,null,null,null,null,null,null,null,"Pavimentação","Valor Base:"]
[null,"Valor Global","SEAB",null,"Contrapartida Município",null,null,null,null,null,null,{"$f":"'Plan2 1.DADOS,2.OBJ e 2.1.Vigên'!E35","v":"MELHORIAS"},{"$f":"VLOOKUP(L7,'Plan2 1.DADOS,2.OBJ e 2.1.Vigên'!#REF!,2,0)","v":{"$error":"#REF!"}}]
[null,null,"(R$)",null,"Financeira (R$)","Fisica (R$)","Total  (R$)"]
[null,{"$f":"'Plan4 2.3. OPERAÇÕES'!D65","v":56617.662049862149},{"$f":"'Plan4 2.3. OPERAÇÕES'!F65","v":53786.77894736905},null,{"$f":"'Plan4 2.3. OPERAÇÕES'!H65","v":2830.8831024931078},{"$f":"'Plan4 2.3. OPERAÇÕES'!I65+'Plan4 2.3. OPERAÇÕES'!J65","v":0},{"$f":"E9+F9","v":2830.8831024931078}]
[]
{"$rows_left_out":42}
{"sheet":"Plan8 9.PREVISÃO e10 CRONOGRAM","index":8,"n_rows":27,"n_cols":12,"rows_kept":27,"cut":false,"hidden":false,"merged":[[6,8,6,11],[5,2,6,4],[6,5,6,7],[5,5,5,11],[7,8,7,11],[7,2,7,4],[7,5,7,7],[15,2,15,4],[14,8,14,11],[15,8,15,11],[15,5,15,7],[14,5,14,7],[14,2,14,4],[11,8,11,11],[12,8,12,11],[13,8,13,11],[10,8,10,11],[10,5,10,7],[11,5,11,7],[12,5,12,7],[13,5,13,7],[8,8,8,11],[9,8,9,11],[24,11,24,13],[23,2,23,13],[18,1,18,13],[19,1,19,13],[24,2,24,4],[24,5,24,7],[24,8,24,10],[17,2,17,4],[10,2,10,4],[11,2,11,4],[16,2,16,4],[9,2,9,4],[9,5,9,7],[8,2,8,4],[8,5,8,7],[1,2,1,13],[12,2,12,4],[26,11,26,13],[25,2,25,4],[25,5,25,7],[25,8,25,10],[26,2,26,4],[26,5,26,7],[26,8,26,10],[25,11,25,13],[16,8,16,11],[17,8,17,11],[16,5,16,7],[17,5,17,7],[13,2,13,4]]}
[]
[null,null,"PLANO DE TRABALHO\n MELHORIA DA TRAFEGABILIDADE EM ESTRADAS RURAIS MUNICIPAIS\nÓLEO DIESEL com base no RTV - Relatório Técnico de Vistoria e Projetos Técnicos"]
[null,"9 - CRONOGRAMA DE EXECUÇÃO"]
[]
[]
[null,null,"Atividades",null,null,"Período de Execução"]
[null,null,null,null,null,"Início",null,null,"Final"]
[null,null,"Licitação",null,null,"A partir da publicação no DIOE",null,null,"até 03 meses após a publicação"]
[null,null,"Contratação",null,null,"XX meses após a publicação",null,null,"XX meses após a publicação"]
[null,null,"Fiscalização",null,null,"XX meses após a publicação",null,null,"XX meses após a publicação"]
{"$rows_left_out":18}
{"sheet":"Plan 09.11MONIT_AVALIA_P.CONTAS","index":9,"n_rows":17,"n_cols":3,"rows_kept":17,"cut":false,"hidden":false,"merged":[[1,2,1,11],[13,1,13,11],[16,1,16,11],[6,1,6,11],[15,1,15,11],[14,1,14,11],[10,1,10,11],[11,1,11,11],[12,1,12,11],[3,1,3,11],[5,1,5,11],[7,1,7,11],[8,1,8,11],[9,1,9,11],[4,1,4,11]]}
[]
[null,null,"PLANO DE TRABALHO\n MELHORIA DA TRAFEGABILIDADE EM ESTRADAS RURAIS MUNICIPAIS\nÓLEO DIESEL com base no RTV - Relatório Técnico de Vistoria e Projetos Técnicos"]
[]
[null,"11. OBRIGAÇÕES"]
[null,"DO MONITORAMENTO, AVALIAÇÃO E DA PRESTAÇÃO DE CONTAS "]
[null,"1. O CONVENENTE TOMADOR realizará a prestação de contas através do Sistema Integrado de Transferências do TCE (SIT) conforme previsões das resoluções nº 28/2011, 46/2014 e a Instrução Normativa 61/2011 e as Cláusulas do Convênio"]
[null,"2.  Cópia de ata da homologação do processo licitatório, contrato, CNO - Cadastro Nacional de Obras, licença ambiental do fornecedor ( pedreira)  do material a ser utilizado na pavimentação."]
[null,"3. O CONVENENTE TOMADOR, apresentará as informações dos resultados alcançados sob os aspectos técnicos e financeiros obtidos com a execução do objeto da parceria na seguinte forma e periodicidade:"]
[null,"3.1)    Bimestralmente, anualmente, a cada liberação de parcela (R$)e após a Conclusão do Convênio  por meio de: "]
[null,"a.  Relatório de Execução do Objeto (PARCIAL E FINAL): documento que descreverá as atividades desenvolvidas, comparativo das metas propostas e resultados alcançados, acompanhado do respectivo material comprobatório. ( mapas de medição e notas fiscais comprobatórias, fotos e filmagens)"]
{"$rows_left_out":8}
{"sheet":"Planilha10  12.DOC_INTEGR_PT ","index":10,"n_rows":24,"n_cols":3,"rows_kept":24,"cut":false,"hidden":false,"merged":[[3,1,3,3],[1,2,1,3],[4,1,4,3],[5,1,5,3],[6,1,6,3],[7,1,7,3],[8,1,8,3],[9,1,9,3],[10,1,10,3],[11,1,11,3],[12,1,12,3],[13,1,13,3],[14,1,14,3],[15,1,15,3],[16,1,16,3],[22,1,22,3],[23,1,23,3],[17,1,17,3],[18,1,18,3],[19,1,19,3],[20,1,20,3],[21,1,21,3]]}
[]
[null,null,"PLANO DE TRABALHO\n MELHORIA DA TRAFEGABILIDADE EM ESTRADAS RURAIS MUNICIPAIS\nÓLEO DIESEL com base no RTV - Relatório Técnico de Vistoria e Projetos Técnicos"]
[]
[null,"12. DOCUMENTOS INTEGRANTES DO PLANO DE TRABALHO "]
[null,"12.1 Descrição do Documento"]
[null,"a) Declaração de Contrapartida (FISICA OU FINANCEIRA ) no valor de R$."]
[null,"b) Orçamentos devidamente detalhado em planilha nos termos dos arts.368 a 372 e dos atrs. 484 a 486 do decreto Estadual 10.086/2022."]
[null,"C) Outros documentos necessários para execução do objeto (Caracterizar os documentos)"]
[]
[null,"12.2 PARA OBRAS OU SERVIÇOS DE ENGENHARIA E ARQUITETURA "]
{"$rows_left_out":15}
{"sheet":"Plan11 10. ASSINATURAS","index":11,"n_rows":78,"n_cols":15,"rows_kept":78,"cut":false,"hidden":false,"merged":[[31,2,31,7],[31,8,31,10],[34,1,34,10],[36,2,36,7],[1,3,1,10],[1,1,1,2],[10,2,10,7],[10,8,10,10],[12,1,12,10],[14,1,14,10],[15,2,15,7],[3,1,3,10],[5,1,5,10],[6,2,6,7],[6,8,9,10],[7,2,7,7],[8,5,8,7],[9,2,9,7],[15,8,20,10],[16,2,16,7],[17,1,17,4],[17,5,17,7],[18,2,18,7],[19,2,19,7],[20,2,20,7],[21,2,21,7],[21,8,21,10],[25,1,25,10],[27,2,27,7],[27,8,30,10],[28,2,28,7],[29,2,29,7],[30,2,30,7],[36,8,39,10],[37,2,37,7],[38,2,38,7],[39,2,39,7],[40,2,40,7],[40,8,40,10],[47,1,47,2],[47,3,47,10],[49,1,49,10],[51,1,51,10],[53,1,53,10],[55,1,57,6],[58,1,58,6],[60,1,60,10],[62,1,64,6],[65,1,65,6],[77,1,77,6],[66,1,66,6],[69,1,69,10],[71,1,71,10],[73,1,75,6],[76,1,76,6]]}
[]
[null,null,null,"PLANO DE TRABALHO\n MELHORIA DA TRAFEGABILIDADE EM ESTRADAS RURAIS MUNICIPAIS\nÓLEO DIESEL com base no RTV - Relatório Técnico de Vistoria e Projetos Técnicos"]
[]
[null,"13. DECLARAÇÃO DO RESPONSÁVEL TÉCNICO PELO PLANO DE APLICAÇÃO FINANCEIRA"]
[]
[null,"Declaro, para fins de prova junto à SEAB, estar de acordo com o plano de aplicação dos recursos deste Plano de Trabalho."]
[null,"Nome:",null,null,null,null,null,null,"__________________________"]
[null,"Cargo:","CONTADOR"]
[null,"N.º Registro Conselho de Classe:",null,null,null,"CRC: xxxx"]
[null,"Local:","XXXXXX"]
{"$rows_left_out":69}
{"sheet":"Municipios","index":12,"n_rows":400,"n_cols":9,"rows_kept":400,"cut":false,"hidden":true,"merged":[]}
["Município","Índice IPARDES 2020","Contrapartida Mínima","Núcleo Regional","CNPJ","Credor","Endereço Prefeitura","Cep Prefeitura","Prefeito"]
["Abatiá",0.65156887470375802,"5%","Cornélio Procópio","75.743.567/0001-57",214799,"Av. João Carvalho Mello, 135, Centro","86.460-000","Nelson Garcia Junior"]
["Adrianópolis",0.67694205309987032,"5%","Curitiba","76.105.642/0001-17",102344,"Av. Marechal Mascarenhas de Morães, 115, Centr","83.490-000","Vandir de Oliveira Rosa"]
["Agudos do Sul",0.59952607767340782,"5%","Curitiba","76.105.667/0001-10",147555,"Av. Brasil, 38, Centro","83.850-000","Jesse da Rocha Zoellner"]
["Almirante Tamandaré",0.62274965975053653,"5%","Curitiba","76.105.659/0001-74",119789,"Av. Emílio Jonhson, 360, Centro","83.501-000","Gerson Denilson Colodel"]
["Altamira do Paraná",0.75979605378002935,"10%","Campo Mourão","78.069.143/0001-47",119790,"R. Cantú, 180, Centro","85.280-000","José Etevaldo de Oliveira"]
["Altônia",0.7319672363408416,"10%","Umuarama","81.478.059/0001-91",119791,"R. Rui Barbosa, 815, Centro","87.550-000","Claudenir Gervasone"]
["Alto Paraíso",0.73644605393649287,"10%","Umuarama","95.640.736/0001-30",119792,"Av. Pedro Amaro dos Santos, 900, Centro","87.528-000","Dércio Jardim Junior"]
["Alto Paraná",0.72169884790600802,"10%","Paranavaí","76.279.967/0001-16",119793,"R. José Anchieta, 1641, Centro","87.750-000","Claudemir Joia Pereira"]
["Alto Piquiri",0.68806261268678703,"5%","Umuarama","76.247.352/0001-08",122329,"R. Santos Dumont, 341, Centro","87.580-000","Giovane Mendes de Carvalho"]
{"$rows_left_out":390}