{"text_format":"1","workbook":"xlsx","n_sheets":14,"sheets":["Plan0_Definições","Plan 1 REND ORIENT Definições ","Plan1.1 ORIENTAÇÕES PREENCHIMEN","Plan2 1.DADOS,2.OBJ e 2.1.Vigên","Plan3 2.2. QUADRO RESUMO","Plan4 2.3. OPERAÇÕES","Plan5 3. JUSTIFIC. e 4.BENEFIC.","Plan6 5.MET_FAS_ETA_CRON_6.METO","Plan7 7. PLA DE APL 8 Cap Int.","Plan8 Parâmetro e &","Planilha9_11_DOC_INTEGR_PT ","Plan10_OBR_MONI_AVAL_P.CONTAS","Plan11_ASSINATURAS","Municipios"],"not_rendered":{"charts":0,"images":6,"macros":1,"external_links":2,"defined_names":11,"comments":4,"pivot_tables":0},"unopened":[],"bounds":{"document_bytes":16777216,"sheet_cells":100000,"rows_first":2000,"rows_last":500,"rows_between":2000,"halvings":0,"cell_chars":16384,"cell_head_chars":4096},"cells_cut":0,"cells_raw":0,"read":"whole","date_system":"1900"}

{"sheet":"Plan0_Definições","index":0,"n_rows":15,"n_cols":3,"rows_kept":15,"cut":false,"hidden":true,"merged":[[9,2,9,11],[1,1,1,11],[3,1,3,11],[5,2,5,11],[6,2,6,11],[7,2,7,11],[8,2,8,11],[10,2,10,11],[12,2,12,11],[11,2,11,11],[13,2,13,11],[14,2,14,11]]}
[]
[null,"PROGRAMA ESTRADAS DA INTEGRAÇÃO  PROJETO DE ADEQUAÇÃO, READEQUAÇÃO, MAUTENÇÃO E OU MELHORIAS DE ESTRADAS RURAIS MUNICIPAIS - CUSTEIO SOMENTE ÓLEO DIESEL COM BASE EM  RTV - Relatório Técnico de Vistoria e Projetos Técnicos"]
[]
[null,"1 . DEFINIÇÕES"]
[]
[null,"1.1","ABERTURA DE ESTRADAS RURAIS:  obra destinada a dar acesso aos lotes que estão sendo objeto de reforma agrária, permitindo assim o livre acesso dos moradores ao comércio, educação, saúde e cidadania. Utilizando –se de práticas para a Conservação de solos e consequentemente das estradas, com a construção de estruturas para captação e retenção de águas pluviais."]
[null,"1.2","ADEQUAÇÃO DE ESTRADAS RURAIS*: obras destinadas à execução de melhoramentos em estradas rurais de menor hierarquia funcional, possuindo superfície de rolamento “não pavimentada”, cujo objetivo é o de elevar seu padrão operacional. Inclui-se nessa modalidade de intervenção:\n•         Serviços de re-locação de parte de seu traçado;\n•         Re-conformação de segmentos do greide;\n•         Execução de camadas de reforço do sub-leito e/ou;\n•         Revestimento primário. \n*Fonte: Estradas rurais Técnicas Adequadas de Manutenção. Florianópolis DER, 2003. 236 p. il. 30cm.\n"]
[null,"1.3","MANUTENÇÃO DE ESTRADA RURAL: pode ser definido como amplo conjunto de atividades destinadas a assegurar um transporte seguro, econômico e confortável em uma estrada ou rede de estradas. Uma das finalidades primordiais da manutenção é evitar, ao máximo possível, a perda desnecessária do capital já investido, mediante a proteção física da estrutura básica e da superfície de rolamento da estrada. A manutenção deve evitar a deterioração precoce da estrutura das estradas e, por conseguinte, a necessidade de serviços de reconstrução. Inclui-se nessa definição, as atividades de manutenção corretiva rotineira e periódica. "]
[null,"1.4","MELHORIA DE ESTRADA RURAL: Conjunto de operações que acrescentam as rodovias (estradas) existentes características novas, sem modificar as existentes ex. colocação de bueiros, sarjeteamento, bigodes, caixas de retenção. (fonte: DNER, glossário de termos técnicos rodoviários, Rio de janeiro, 1997, 266p. IPR. Publ.; 700)."]
[null,"1.5","Trafegabilidade é uma palavra derivada de trafegável, que se pode trafegar, andar no tráfego; fazer algum caminho; andar, transitar: os pedestres precisam de cuidado ao trafegar por ruas movimentadas. (fonte: https://www.dicio.com.br)"]
{"$rows_left_out":6}
{"sheet":"Plan 1 REND ORIENT Definições ","index":1,"n_rows":11,"n_cols":12,"rows_kept":11,"cut":false,"hidden":false,"merged":[[1,1,1,7],[10,1,72,7]]}
[]
[null,"Rendimentos de serviços"]
[null,"nº","Serviço","Rendimento esperado p/ execução estrada pronta km /mes ","Execução estrada pronta km /ano (10 meses)","possiveis serviços listado nas operações a executar","Autorização ambiental","Anotação de responsabilidade técnica, conforme conselho de classe"]
[null,1,"Adequação c/cascalho",{"$f":"((25+30)/2)/10","v":2.75},{"$f":"D4*10","v":27.5},"Todos","x","x"]
[null,2,"Readequação c/cascalho",{"$f":"((25+30)/2)/10","v":2.75},{"$f":"D5*10","v":27.5},"Todos","x","x",null,null,null,{"$f":"20/D5","v":7.2727272727272725}]
[null,3,"Manutenção s/cascalho (reconstrução e ou recuperação dos serviços)",{"$f":"50/10","v":5},{"$f":"D6*10","v":50},"Terraplenagem nº 03,04, 05 ou 06 ou 12,7,8,10,11, drenagem - 24",null,"x"]
[null,4,"Melhoria c/cascalho em ptos criticos",{"$f":"100/10","v":10},{"$f":"D7*10","v":100},"Terraplenagem nº 03,04, 05 ou 06 ou 12,7,8,10,11, drenagem 13-27, cascalhamento 28-29","x","x"]
[null,5,"Melhoria s/cascalho ",{"$f":"150/10","v":15},{"$f":"D8*10","v":150},"Terraplenagem nº 03,04, 05 ou 06 ou 12,7,8,10,11, drenagem 13-27","x","x"]
[]
[]
{"$rows_left_out":2}
{"sheet":"Plan1.1 ORIENTAÇÕES PREENCHIMEN","index":2,"n_rows":47,"n_cols":5,"rows_kept":47,"cut":false,"hidden":false,"merged":[[22,0,24,0],[27,0,28,0],[29,0,30,0],[32,0,33,0],[38,0,43,0],[35,0,37,0],[0,0,0,10],[24,1,24,10],[26,1,26,10],[27,1,27,10],[14,1,14,10],[1,0,1,10],[13,1,13,10],[4,1,4,10],[3,1,3,10],[7,1,7,10],[12,1,12,10],[10,0,10,10],[6,1,6,10],[5,1,5,10],[18,0,18,10],[20,1,20,10],[36,1,36,10],[37,1,37,10],[21,1,21,10],[22,1,22,10],[23,1,23,10],[30,1,30,10],[25,1,25,10],[28,1,28,10],[29,1,29,10],[8,1,8,10],[44,0,44,10],[53,0,53,10],[46,4,51,5],[45,0,45,10],[31,1,31,10],[32,1,32,10],[33,1,33,10],[39,1,39,10],[43,1,43,10],[42,1,42,10],[41,1,41,10],[40,1,40,10],[38,1,38,10],[34,1,34,10],[35,1,35,10]]}
["PROGRAMA ESTRADAS DA INTEGRAÇÃO  PROJETO DE ADEQUAÇÃO, READEQUAÇÃO, MAUTENÇÃO E OU MELHORIAS DE ESTRADAS RURAIS MUNICIPAIS - CUSTEIO SOMENTE ÓLEO DIESEL COM BASE EM  RTV - Relatório Técnico de Vistoria e Projetos Técnicos"]
["1 . ORIENTAÇÕES PARA O PREENCHIMENTO DA PLANILHA"]
[]
["1.1","Todas as células com a cor AZUL devem ser preenchidas pelo MUNICÍPIO"]
["1.2","Todas as células preenchidas de VERDE são resultados automáticos de fórmulas e NÃO PODEM SER MODIFICADAS.\nCaso haja necessidade de incluir novas linhas na planilha é importante verificar se as fórmulas estão contemplando todas as células, conferindo o Número e Letra na fórmula ao clicar nelas. Nesse caso, excepcionalmente, deve-se fazer a correção da fórmula para anular erros (por isso as células não foram bloqueadas)."]
["1.3","A logomarca do município deve ser inserida dentro do quadro abaixo e a mesma será replicada em todas as páginas do plano de trabalho."]
["1.4","Caso a largura de alguma coluna precise ser modificada, para impressão não cortar a página, clicar em Exibir > Vizualização da Quebra de Página: arrastar a linha de quebra para contemplar toda a tabela. Depois Exibir > Normal, para voltar à visualização de planilha."]
["1.5","O valor de contrapartida municipal  é obrigatória  para todas as trasnferencias voluntárias, conforme Lei Federal- nº 14.133 e Decreto Estadual nº 10086, com base do Índice Ipardes de Desempenho Municipal, ano referencia 2021 (https://www.ipardes.pr.gov.br/Pagina/Indice-Ipardes-de-Desempenho-Municipal)"]
["1.6","O plano de trabalho deve ser preenchido, conforme Lei Federal- nº 14.133/2021 e Decreto Estadual nº 10086/2022."]
[]
{"$rows_left_out":38}
{"sheet":"Plan2 1.DADOS,2.OBJ e 2.1.Vigên","index":3,"n_rows":64,"n_cols":13,"rows_kept":64,"cut":false,"hidden":false,"merged":[[20,11,21,17],[13,2,13,8],[8,6,8,8],[8,2,8,4],[12,5,12,8],[11,2,11,8],[12,2,12,3],[9,6,9,8],[10,2,10,8],[17,2,17,4],[38,4,38,8],[1,2,1,8],[26,2,26,8],[27,2,27,3],[27,5,27,8],[22,2,22,8],[23,6,23,8],[23,2,23,3],[18,2,18,8],[19,2,19,8],[21,2,21,8],[20,6,20,8],[17,5,17,6],[6,2,6,8],[7,2,7,8],[17,7,17,8],[23,4,23,5],[37,1,37,3],[29,1,29,8],[24,2,24,8],[34,1,34,3],[35,1,35,3],[36,1,36,3],[30,1,32,8],[37,4,37,8],[36,4,36,8],[35,4,35,8],[34,4,34,8]]}
[]
[null,null,"PLANO DE TRABALHO\n MELHORIA DA TRAFEGABILIDADE EM ESTRADAS RURAIS MUNICIPAIS\nÓLEO DIESEL com base no RTV - Relatório Técnico de Vistoria e Projetos Técnicos"]
[]
[null,"1. DADOS CADASTRAIS "]
[null,"1.1 DO CONCEDENTE"]
[]
[null,"Secretaria","Secretaria da Agricultura e do Abastecimento"]
[null,"CNPJ:","76.416.957/0001-85"]
[null,"Endereço:","Rua dos Funcionários nº 1559, Cabral",null,null,"Município:","Curitiba"]
[null,"UF:","PR","CEP:","80035-050","Telefone:","(41) 3313-4000"]
{"$rows_left_out":55}
{"sheet":"Plan3 2.2. QUADRO RESUMO","index":4,"n_rows":21,"n_cols":14,"rows_kept":21,"cut":false,"hidden":false,"merged":[[5,3,6,3],[5,8,6,8],[21,1,21,13],[20,1,20,13],[18,1,18,6],[17,1,17,6],[1,5,1,13],[3,1,3,13],[5,1,6,1],[5,2,6,2],[1,1,1,2],[5,11,6,11],[5,13,6,13],[5,12,6,12],[5,7,6,7],[5,4,5,6],[5,10,6,10],[5,9,6,9]]}
[]
[null,null,null,null,null,"PLANO DE TRABALHO\n MELHORIA DA TRAFEGABILIDADE EM ESTRADAS RURAIS MUNICIPAIS\nÓLEO DIESEL com base no RTV - Relatório Técnico de Vistoria e Projetos Técnicos"]
[]
[null,"2.2. Quadro Resumo (Total das Estradas Rurais/trechos indicados nos RTV’s*)"]
[]
[null,"nº","Estrada Rural/ Nome/ Trechos","Tipo de Serviço (ADEQUAÇÃO / READEQUAÇÃO / MANUTENÇÃO / MELHORIA)","Coordenadas UTM - SAD-69",null,null,"Extensão total(m)","Extensão cascalhamento (m)","Larg. total (m)","Larg. Cascalhamento (m)","Espessura cascalho compactado (m)","Área total (m²)","Área cascalhada(m²)"]
[null,null,null,null,"FUSO","Início                        Lat./Long.","Término                       Lat./Long."]
[null,1,"xxx",null,"zz","vvv","bbb",10000,1000,7,6,0.15,{"$f":"H8*J8","v":70000},{"$f":"I8*K8","v":6000}]
[null,2,null,null,null,null,null,12000,1200,3,2,7.0000000000000007E-2,{"$f":"H9*J9","v":36000},{"$f":"I9*K9","v":2400}]
[null,3,null,null,null,null,null,80000,800,2.5,2,7.0000000000000007E-2,200000,1600]
{"$rows_left_out":12}
{"sheet":"Plan4 2.3. OPERAÇÕES","index":5,"n_rows":64,"n_cols":23,"rows_kept":64,"cut":false,"hidden":false,"merged":[[16,13,17,13],[1,3,2,16],[6,20,6,22],[24,1,25,1],[24,3,25,3],[43,1,45,1],[43,3,45,3],[26,1,26,12],[31,4,31,7],[32,4,32,7],[33,4,33,7],[34,4,34,7],[35,4,35,7],[36,4,36,7],[29,4,29,7],[30,4,30,7],[37,4,37,7],[38,4,38,7],[39,4,39,7],[24,13,25,13],[21,3,22,3],[1,21,1,22],[1,18,2,18],[10,4,11,7],[20,4,20,7],[21,4,22,7],[23,4,23,7],[24,4,25,7],[6,1,7,3],[21,9,22,9],[24,9,25,9],[21,8,22,8],[24,8,25,8],[16,1,17,1],[16,3,17,3],[21,1,22,1],[16,9,17,9],[16,8,17,8],[19,4,19,7],[13,4,13,7],[14,4,14,7],[15,4,15,7],[16,4,17,7],[18,4,18,7],[6,4,7,7],[6,8,8,8],[12,4,12,7],[7,20,8,20],[2,21,2,22],[10,1,11,1],[10,2,11,2],[10,3,11,3],[10,9,11,9],[6,9,8,9],[9,13,9,15],[7,21,7,22],[4,19,4,20],[4,21,4,22],[4,1,4,18],[8,4,8,7],[6,17,6,18],[7,18,8,18],[7,17,8,17],[6,16,8,16],[6,15,8,15],[6,11,8,11],[6,14,8,14],[6,13,8,13],[10,13,11,13],[5,1,5,3],[5,19,5,20],[43,8,45,8],[59,2,60,2],[59,3,60,3],[58,2,58,3],[55,1,55,18],[47,1,47,12],[51,4,51,7],[50,1,50,12],[50,13,50,15],[47,13,47,15],[59,4,60,4],[59,5,60,5],[48,4,48,7],[49,4,49,7],[43,4,45,7],[46,4,46,7],[5,21,5,22],[58,4,58,8],[59,6,59,7],[59,8,60,8],[59,9,60,9],[59,10,60,10],[58,9,58,10],[42,13,42,15],[42,1,42,12],[52,4,52,7],[57,2,57,10],[7,19,8,19],[53,1,53,15],[27,4,27,7],[28,4,28,7],[21,13,22,13],[26,13,26,15],[9,1,9,12],[6,12,8,12],[6,10,8,10],[40,4,40,7],[41,4,41,7],[43,13,45,13],[43,9,45,9]]}
[]
[null,null,null,"PLANO DE TRABALHO\n MELHORIA DA TRAFEGABILIDADE EM ESTRADAS RURAIS MUNICIPAIS\nÓLEO DIESEL com base no RTV - Relatório Técnico de Vistoria e Projetos Técnicos",null,null,null,null,null,null,null,null,null,null,null,null,null,null,"Contrapartida:  ","Municipio","IPDM","% DA CONTRAPARTDIDA"]
[null,null,null,null,null,null,null,null,null,null,null,null,null,null,null,null,null,null,null,{"$f":"'Plan2 1.DADOS,2.OBJ e 2.1.Vigên'!C18","v":"Adrianópolis"},{"$f":"VLOOKUP(T3,Municipios!A:C,2,0)","v":0.64804302597985686},{"$f":"VALUE(VLOOKUP(U3,Municipios!B:D,2,0))","v":0.05}]
[]
[null,"2.3. Operações a serem executadas nos trechos (referência utilizada de rendimentos: Tabelas de composição de custos SEIL/DER/PR). E excepcionalmente SINAPI E DNIT, nos casos de serviços não contemplados pela tabeLa do DER-Pr",null,null,null,null,null,null,null,null,null,null,null,null,null,null,null,null,null,"ANP (DD/MM/AAAA)",null,"2022-10-01"]
[null,"SITE  FONTE:",null,null,"https://www.gov.br/anp/pt-br/assuntos/precos-e-defesa-da-concorrencia/precos",null,null,null,null,null,null,null,null,null,null,null,null,null,null,"OUTRO ESPECIFICAR (DD/MM/AAAA)"]
[null,"Tipo  Serviço:",null,null,{"$f":"'Plan2 1.DADOS,2.OBJ e 2.1.Vigên'!E35","v":"MANUTENÇÃO"},null,null,null,"Unid.","Qtd.","Rodovia pavimentada   DMT - km","Rodovia não pavimentada    DMT - km","MÁQUINA (referência)  E OUTROS A UTILIZAR","RENDIMENTO ESPERADO ","Nº DE HORAS MÁQUINAS E CAMINHÕES / outros","média de consumo  de OD                L/ HORA","N° DE LITROS OD -Óleo diesel","CUSTO  ÓLEO DIESEL - ANP EM .../.../202...(R$) e outros custos",null,"SEAB","CONTRAPARTIDA (MUNICÍPIO)²"]
[null,null,null,null,null,null,null,null,null,null,null,null,null,null,null,null,null,"UNITÁRIO","TOTAL","R$","FINANCEIRA R$","FÍSICA"]
[null,"Nº","Natureza de despesa","Código DER PR","Itens",null,null,null,null,null,null,null,null,null,null,null,null,null,null,null,null,"SERVIÇOS","BENS"]
[null,"01-TERRAPLENAGEM",null,null,null,null,null,null,null,null,null,null,null,{"$f":"CONCATENATE(\"SubTotal \",B10)","v":"SubTotal 01-TERRAPLENAGEM"},null,null,{"$f":"SUM(Q11:Q26)","v":2748.504249543581},null,{"$f":"SUM(S11:S26)","v":13770.006290213345},13081.505975702676,688.50031451066718,0,0]
{"$rows_left_out":55}
{"sheet":"Plan5 3. JUSTIFIC. e 4.BENEFIC.","index":6,"n_rows":31,"n_cols":7,"rows_kept":31,"cut":false,"hidden":false,"merged":[[1,3,1,5],[5,1,5,5],[1,1,1,2],[9,4,9,5],[9,1,10,3],[3,1,3,5],[16,1,16,3],[17,1,17,3],[18,1,18,3],[19,1,19,3],[20,1,20,3],[11,1,11,3],[12,1,12,3],[13,1,13,3],[14,1,14,3],[15,1,15,3],[29,1,29,3],[27,4,27,5],[29,4,29,5],[30,1,30,5],[21,1,21,3],[22,1,22,3],[23,1,23,3],[24,1,24,3],[25,1,25,3],[26,1,26,3],[27,1,27,3],[28,1,28,3]]}
[]
[null,null,null,"PLANO DE TRABALHO\n MELHORIA DA TRAFEGABILIDADE EM ESTRADAS RURAIS MUNICIPAIS\nÓLEO DIESEL com base no RTV - Relatório Técnico de Vistoria e Projetos Técnicos"]
[]
[null,"3. RAZÕES PARA CELEBRAÇÃO - JUSTIFICATIVA"]
[]
[null,"1. Discorrer as razões que justificam a celebração do instrumento, caracterizando (evidenciando) e indicando, entre outras:\na) interesses recíprocos entre a Seab e o Município, e o atendimento da(s) necessidade (s) da comunidade (s) a serem benficiadas;\nb) relação entre a projeto técnico apresentado, operações a serem executadas e objetivos do plano, programa, projeto ou proposta estadual ou municipal;\nc) qualificação do público alvo;\nd) problemas a serem resolvidos; \ne) resultados esperados; \nf)  Índice Desempenho Municipal (IDM/Ipardes) ou IDH - posição do Município em relação à média do Estado, ...;\ng) VBP - Principais produtos, posição do Município em relação à média do Estado, ...;\nh) Proporção de agricultores familiares em relação ao total de produtores/agricultores do município;\ni) Famílias do meio rural abaixo da linha de pobreza e/ou inscritas no CadUnico;\nj) Estrutura fundiário do município;\nk)Outras informações relevantes.\n"]
[]
[null,"4. BENEFICIÁRIOS"]
[]
[null,"Nome da(s)  comunidade(s)",null,null,"Quantidade Usuários ( *)"]
{"$rows_left_out":22}
{"sheet":"Plan6 5.MET_FAS_ETA_CRON_6.METO","index":7,"n_rows":34,"n_cols":15,"rows_kept":34,"cut":false,"hidden":false,"merged":[[15,12,18,12],[15,11,18,11],[11,10,14,10],[15,1,18,1],[15,2,18,2],[15,9,18,9],[15,10,18,10],[32,1,32,12],[33,1,46,12],[20,1,21,1],[20,2,21,2],[24,1,24,12],[25,2,25,12],[26,2,26,12],[27,2,27,12],[28,2,28,12],[29,2,29,12],[31,1,31,12],[9,9,9,10],[9,11,10,11],[9,12,10,12],[11,1,14,1],[11,2,14,2],[11,5,14,5],[11,6,14,6],[11,7,14,7],[11,8,14,8],[11,9,14,9],[9,1,9,2],[9,3,10,3],[9,4,10,4],[9,5,9,6],[9,7,9,8],[13,11,14,11],[1,1,1,3],[1,5,1,12],[3,1,3,12],[5,1,5,12],[8,1,8,12]]}
[]
[]
[]
[]
[]
[null,"5. DEFINIÇÃO E DETALHAMENTO DAS METAS COM AS FASES E ETAPAS DE EXECUÇÃO E O CRONOGRAMA DE FISICO/ FINANCEIRO DA EXECUÇÃO"]
[]
[]
[null,{"$f":"CONCATENATE(\"Meta: Melhoria da trafegabilidade, por meio da execução de serviços de \", O9,\", com \",O10,\" m²\")","v":"Meta: Melhoria da trafegabilidade, por meio da execução de serviços de MANUTENÇÃO, com 75.600,00 m²"},null,null,null,null,null,null,null,null,null,null,null,null,{"$f":"'Plan2 1.DADOS,2.OBJ e 2.1.Vigên'!E35","v":"MANUTENÇÃO"}]
[null,"Fases",null,"Etapa","Especificação","Indicador Físico",null,"Custo (R$)",null,"Período de execução",null,"Responsável","Instrumentos de avaliação do cumprimento da fase ou etapa ",null,{"$f":"'[1]Plan2 1.DADOS,2.OBJ e 2.1.Vigên'!L33","v":"75.600,00"}]
{"$rows_left_out":25}
{"sheet":"Plan7 7. PLA DE APL 8 Cap Int.","index":8,"n_rows":41,"n_cols":16,"rows_kept":41,"cut":false,"hidden":false,"merged":[[14,8,14,9],[15,8,15,9],[16,8,16,9],[13,8,13,9],[5,2,5,9],[11,4,13,4],[12,7,13,7],[11,5,11,7],[1,4,1,8],[6,6,6,8],[11,2,18,2],[6,9,7,9],[6,4,6,5],[11,3,13,3],[7,4,7,5],[8,4,8,5],[6,2,7,2],[6,3,7,3],[12,5,13,5],[12,6,13,6],[18,8,18,9],[10,2,10,9],[17,8,17,9],[11,8,12,9],[41,2,41,10],[19,2,19,10],[20,2,20,10],[22,2,22,10],[39,2,39,10],[40,2,40,10],[27,7,27,8],[27,9,27,10],[26,2,26,10],[27,2,27,6],[23,2,24,10]]}
[]
[null,null,null,null,"PLANO DE TRABALHO\n MELHORIA DA TRAFEGABILIDADE EM ESTRADAS RURAIS MUNICIPAIS\nÓLEO DIESEL com base no RTV - Relatório Técnico de Vistoria e Projetos Técnicos"]
[]
[null,null,"7 - PLANO DE APLICAÇÃO DOS RECURSOS FINANCEIROS COM CRONOGRAMA DE DESEMBOLSO"]
[]
[null,null,"PLANO DE APLICAÇÃO DOS RECURSOS - RESUMO DAS METAS ",null,null,null,null,null,null,null,null,null,null,"Pavimentação","Valor Base:"]
[null,null,"Descrição ","NATUREZA DE DESPESA","SEAB",null,"Contrapartida Município",null,null,"Valor Global - (R$)",null,null,null,{"$f":"'Plan2 1.DADOS,2.OBJ e 2.1.Vigên'!E35","v":"MANUTENÇÃO"},{"$f":"VLOOKUP(N7,'Plan2 1.DADOS,2.OBJ e 2.1.Vigên'!#REF!,2,0)","v":{"$error":"#REF!"}}]
[null,null,null,null,"(R$)",null,"Financeira (R$)","Bens e/ou serviços (R$)","Total  (R$)",null,null,{"$f":"TEXT('Plan4 2.3. OPERAÇÕES'!Q54,\"#.##0.000,00\")","v":"4.300,42"}]
[null,null,{"$f":"CONCATENATE(\"Contratação de empresa para fornecimento de \",L8,\" litros de combustível - Óleo Diesel - OD\")","v":"Contratação de empresa para fornecimento de 4.300,42 litros de combustível - Óleo Diesel - OD"},"3.3.90.30.03",{"$f":"'Plan4 2.3. OPERAÇÕES'!D62","v":20467.864902736008},null,{"$f":"'Plan4 2.3. OPERAÇÕES'!F62","v":3852.986047512421},{"$f":"'Plan4 2.3. OPERAÇÕES'!G62","v":8607.8437999999987},{"$f":"G9+H9","v":12460.829847512419},{"$f":"E9+I9","v":32928.694750248425}]
[]
{"$rows_left_out":32}
{"sheet":"Plan8 Parâmetro e &","index":9,"n_rows":23,"n_cols":4,"rows_kept":23,"cut":false,"hidden":false,"merged":[[0,3,3,12],[11,1,19,12],[21,1,21,12],[22,1,36,12],[5,1,5,12],[6,1,8,12],[10,1,10,12]]}
[null,null,null,"PLANO DE TRABALHO\n MELHORIA DA TRAFEGABILIDADE EM ESTRADAS RURAIS MUNICIPAIS\nÓLEO DIESEL com base no RTV - Relatório Técnico de Vistoria e Projetos Técnicos"]
[]
[]
[]
[]
[null,"8. PARÂMETRO(S) PARA AFERIÇÃO DO CUMPRIMENTO DA META"]
[null,"Descrever a forma, modo, de avaliação dos resultados que permitirão a aferição dos resultados do convênio (ou seja, a conferência de seu objeto ter sido cumprido).\nConsiderar que para cada “problema” houve um modo, meio ou forma que o detectou ou o avaliou, sendo esse o parâmetro objetivo de avaliação.\n\nOs trechos serão classificados em Padrão A, B, C ou D, de acordo com sua condição atual, conforme os procedimentos para seleção. O cumprimento da meta será verificado pela mudança de Padrão, de acordo com a seguinte legenda:\n\n1. Padrão A: Estrada Rural com segmentos críticos, impedindo o tráfego contínuo em períodos prolongados do ano.\n2. Padrão B: Estrada Rural adequada, readequada ou melhorada, com conservação regular e pontos críticos que ainda impedem o tráfego contínuo em períodos sazonais.\n3. Padrão C: Estrada Rural adequada, readequada ou melhorada, com boa conservação, mas ainda com pontos críticos que impedem o tráfego contínuo em períodos esporádicos.\n4. Padrão D: Estrada Rural adequada, conservada, com práticas eficientes de conservação de solos e água, possibilitando o tráfego contínuo ao longo de todos os meses do ano.\n\nApós o preenchimento, deletar o texto em vermelho.\n"]
[]
[]
[]
{"$rows_left_out":14}
{"sheet":"Planilha9_11_DOC_INTEGR_PT ","index":10,"n_rows":20,"n_cols":6,"rows_kept":20,"cut":false,"hidden":false,"merged":[[18,1,18,3],[19,1,19,3],[14,1,14,3],[15,1,15,3],[16,1,16,3],[17,1,17,3],[11,1,11,3],[12,1,12,3],[13,1,13,3],[7,1,7,3],[8,1,8,3],[9,1,9,3],[10,1,10,3],[3,1,3,3],[1,2,1,3],[4,1,4,3],[5,1,5,3],[6,1,6,3]]}
[]
[null,null,"PLANO DE TRABALHO\n MELHORIA DA TRAFEGABILIDADE EM ESTRADAS RURAIS MUNICIPAIS\nÓLEO DIESEL com base no RTV - Relatório Técnico de Vistoria e Projetos Técnicos"]
[]
[null,"11. DOCUMENTOS INTEGRANTES DO PLANO DE TRABALHO "]
[null,"11.1 Descrição do Documento"]
[null,{"$f":"CONCATENATE(\"a) Declaração de Contrapartida (FISICA OU FINANCEIRA) no valor de R$ \",F6)","v":"a) Declaração de Contrapartida (FISICA OU FINANCEIRA) no valor de R$ 3.852,99"},null,null,null,{"$f":"TEXT('Plan4 2.3. OPERAÇÕES'!F62,\"#.##0,00\")","v":"3.852,99"}]
[null,"b) Orçamentos devidamente detalhado em planilha nos termos dos arts.368 a 372 e dos atrs. 484 a 486 do decreto Estadual 10.086/2022."]
[null,"C) Outros documentos necessários para execução do objeto (Caracterizar os documentos)"]
[]
[null,"11.2 PARA OBRAS OU SERVIÇOS DE ENGENHARIA E ARQUITETURA "]
{"$rows_left_out":11}
{"sheet":"Plan10_OBR_MONI_AVAL_P.CONTAS","index":11,"n_rows":17,"n_cols":3,"rows_kept":17,"cut":false,"hidden":false,"merged":[[1,2,1,11],[13,1,13,11],[16,1,16,11],[6,1,6,11],[15,1,15,11],[14,1,14,11],[10,1,10,11],[11,1,11,11],[12,1,12,11],[3,1,3,11],[5,1,5,11],[7,1,7,11],[8,1,8,11],[9,1,9,11],[4,1,4,11]]}
[]
[null,null,"PLANO DE TRABALHO\n MELHORIA DA TRAFEGABILIDADE EM ESTRADAS RURAIS MUNICIPAIS\nÓLEO DIESEL com base no RTV - Relatório Técnico de Vistoria e Projetos Técnicos"]
[]
[null,"12. OBRIGAÇÕES"]
[null,"DO MONITORAMENTO, AVALIAÇÃO E DA PRESTAÇÃO DE CONTAS "]
[null,"1. O CONVENENTE TOMADOR realizará a prestação de contas através do Sistema Integrado de Transferências do TCE (SIT) conforme previsões das resoluções nº 28/2011, 46/2014 e a Instrução Normativa 61/2011 e as Cláusulas do Convênio"]
[null,"2.  Cópia de ata da homologação do processo licitatório, contrato, CNO - Cadastro Nacional de Obras, licença ambiental do fornecedor ( pedreira)  do material a ser utilizado na pavimentação."]
[null,"3. O CONVENENTE TOMADOR, apresentará as informações dos resultados alcançados sob os aspectos técnicos e financeiros obtidos com a execução do objeto da parceria na seguinte forma e periodicidade:"]
[null,"3.1)    Bimestralmente, anualmente, a cada liberação de parcela (R$)e após a Conclusão do Convênio  por meio de: "]
[null,"a.  Relatório de Execução do Objeto (PARCIAL E FINAL): documento que descreverá as atividades desenvolvidas, comparativo das metas propostas e resultados alcançados, acompanhado do respectivo material comprobatório. ( mapas de medição e notas fiscais comprobatórias, fotos e filmagens)"]
{"$rows_left_out":8}
{"sheet":"Plan11_ASSINATURAS","index":12,"n_rows":66,"n_cols":15,"rows_kept":66,"cut":false,"hidden":false,"merged":[[65,1,65,6],[55,1,55,6],[58,1,58,10],[61,1,63,6],[64,1,64,6],[59,1,60,10],[46,1,48,6],[49,1,49,6],[50,1,50,10],[51,1,53,6],[54,1,54,6],[41,1,41,2],[41,3,41,10],[43,1,43,10],[44,1,44,10],[45,1,45,10],[30,8,33,10],[31,2,31,7],[32,2,32,7],[33,2,33,7],[34,2,34,7],[34,8,34,10],[19,2,19,7],[19,8,19,10],[21,1,21,10],[22,2,22,7],[22,8,25,10],[23,2,23,7],[24,2,24,7],[25,2,25,7],[7,5,7,7],[8,2,8,7],[13,8,18,10],[14,2,14,7],[15,1,15,4],[15,5,15,7],[16,2,16,7],[17,2,17,7],[18,2,18,7],[26,2,26,7],[26,8,26,10],[29,1,29,10],[30,2,30,7],[1,3,1,10],[1,1,1,2],[9,2,9,7],[9,8,9,10],[11,1,11,10],[12,1,12,10],[13,2,13,7],[3,1,3,10],[4,1,4,10],[5,2,5,7],[5,8,8,10],[6,2,6,7]]}
[]
[null,null,null,"PLANO DE TRABALHO\n MELHORIA DA TRAFEGABILIDADE EM ESTRADAS RURAIS MUNICIPAIS\nÓLEO DIESEL com base no RTV - Relatório Técnico de Vistoria e Projetos Técnicos"]
[]
[null,"13. DECLARAÇÃO DO RESPONSÁVEL TÉCNICO PELO PLANO DE APLICAÇÃO FINANCEIRA"]
[null,"Declaro, para fins de prova junto à SEAB, estar de acordo com o plano de aplicação dos recursos deste Plano de Trabalho."]
[null,"Nome:",null,null,null,null,null,null,"__________________________"]
[null,"Cargo:","CONTADOR"]
[null,"N.º Registro Conselho de Classe:",null,null,null,"CRC: xxxx"]
[null,"Local:","XXXXXX"]
[null,"Data:"," __ /__ /2024",null,null,null,null,null,"Assinatura"]
{"$rows_left_out":57}
{"sheet":"Municipios","index":13,"n_rows":401,"n_cols":9,"rows_kept":401,"cut":false,"hidden":true,"merged":[]}
["Município","Índice IPARDES 2021","Contrapartida Mínima","Núcleo Regional","CNPJ","Credor","Endereço Prefeitura","Cep Prefeitura","Prefeito"]
["Abatiá",0.69398484570270458,"5%","Cornélio Procópio","75.743.567/0001-57",214799,"Av. João Carvalho Mello, 135, Centro","86.460-000","Nelson Garcia Junior"]
["Adrianópolis",0.64804302597985686,"5%","Curitiba","76.105.642/0001-17",102344,"Av. Marechal Mascarenhas de Morães, 115, Centr","83.490-000","Vandir de Oliveira Rosa"]
["Agudos do Sul",0.63719632024833683,"5%","Curitiba","76.105.667/0001-10",147555,"Av. Brasil, 38, Centro","83.850-000","Jesse da Rocha Zoellner"]
["Almirante Tamandaré",0.62891538512308487,"5%","Curitiba","76.105.659/0001-74",119789,"Av. Emílio Jonhson, 360, Centro","83.501-000","Gerson Denilson Colodel"]
["Altamira do Paraná",0.74667674184605204,"10%","Campo Mourão","78.069.143/0001-47",119790,"R. Cantú, 180, Centro","85.280-000","José Etevaldo de Oliveira"]
["Altônia",0.74074010556577408,"10%","Umuarama","81.478.059/0001-91",119791,"R. Rui Barbosa, 815, Centro","87.550-000","Claudenir Gervasone"]
["Alto Paraíso",0.6819360693187656,"5%","Umuarama","95.640.736/0001-30",119792,"Av. Pedro Amaro dos Santos, 900, Centro","87.528-000","Dércio Jardim Junior"]
["Alto Paraná",0.70713959757004285,"10%","Paranavaí","76.279.967/0001-16",119793,"R. José Anchieta, 1641, Centro","87.750-000","Claudemir Joia Pereira"]
["Alto Piquiri",0.75810472347450364,"10%","Umuarama","76.247.352/0001-08",122329,"R. Santos Dumont, 341, Centro","87.580-000","Giovane Mendes de Carvalho"]
{"$rows_left_out":391}