{"text_format":"1","workbook":"xlsx","n_sheets":13,"sheets":["Plan1 ORIENTAÇÕES PREENCHIMENTO","Plan2 1.DADOS,2.OBJ e 2.1.Vigên","Plan3 2.2. QUADRO RESUMO","Plan4 2.3. OPERAÇÕES","Plan5 3. JUSTIFIC. e 4.BENEFIC.","Plan6 5.MET_FAS_ETA_CRON_6.METO","Plan7 7. PLA DE APL 8 Cap Int.","Plan8 9_Parâmetro e 10-11-&","Plan9 12. OBR_MONI_AVAL","Plan10 13.DOC_INTEGR_PT ","Plan11  ASSINATURAS","Serviços","Municipios"],"not_rendered":{"charts":0,"images":2,"macros":0,"external_links":1,"defined_names":12,"comments":2,"pivot_tables":0},"unopened":[],"bounds":{"document_bytes":16777216,"sheet_cells":100000,"rows_first":2000,"rows_last":500,"rows_between":2000,"halvings":0,"cell_chars":16384,"cell_head_chars":4096},"cells_cut":0,"cells_raw":0,"read":"whole","date_system":"1900"}

{"sheet":"Plan1 ORIENTAÇÕES PREENCHIMENTO","index":0,"n_rows":48,"n_cols":5,"rows_kept":48,"cut":false,"hidden":false,"merged":[[0,0,0,10],[45,0,45,10],[54,0,54,10],[47,4,52,5],[46,0,46,10],[32,1,32,10],[33,1,33,10],[34,1,34,10],[40,1,40,10],[44,1,44,10],[43,1,43,10],[42,1,42,10],[41,1,41,10],[39,1,39,10],[35,1,35,10],[36,1,36,10],[37,1,37,10],[38,1,38,10],[22,1,22,10],[23,1,23,10],[24,1,24,10],[31,1,31,10],[26,1,26,10],[29,1,29,10],[30,1,30,10],[39,0,44,0],[36,0,38,0],[1,0,1,10],[25,1,25,10],[27,1,27,10],[28,1,28,10],[15,1,15,10],[2,0,2,10],[14,1,14,10],[5,1,5,10],[4,1,4,10],[8,1,8,10],[13,1,13,10],[11,0,11,10],[7,1,7,10],[6,1,6,10],[9,1,9,10],[23,0,25,0],[28,0,29,0],[30,0,31,0],[33,0,34,0],[19,0,19,10],[21,1,21,10]]}
["PLANO DE TRABALHO  - PROGRAMA ESTRADAS DA INTEGRAÇÃO -PEI"]
[" PROJETO DE PAVIMENTAÇÃO DE ESTRADAS\n RURAIS MUNICIPAIS"]
["1 . ORIENTAÇÕES PARA O PREENCHIMENTO DA PLANILHA"]
[]
["1.1","Todas as células com a cor AZUL devem ser preenchidas pelo MUNICÍPIO"]
["1.2","Todas as células preenchidas de VERDE são resultados automáticos de fórmulas e NÃO PODEM SER MODIFICADAS. OBSERVAR O PREENCHIMENTO DAS LISTAS SUSPENSAS.\nCaso haja necessidade de incluir novas linhas na planilha é importante verificar se as fórmulas estão contemplando todas as células, conferindo o Número e Letra na fórmula ao clicar nelas. Nesse caso, excepcionalmente, deve-se fazer a correção da fórmula para anular erros (por isso as células não foram bloqueadas)."]
["1.3","A logomarca do município deve ser inserida dentro do quadro abaixo e a mesma será replicada em todas as páginas do plano de trabalho."]
["1.4","Caso a largura de alguma coluna precise ser modificada, para impressão não cortar a página, clicar em Exibir > Vizualização da Quebra de Página: arrastar a linha de quebra para contemplar toda a tabela. Depois Exibir > Normal, para voltar à visualização de planilha."]
["1.5","O valor de contrapartida municipal  é obrigatória  para todas as trasnferencias voluntárias, conforme Lei Federal- nº 14.133 e Decreto Estadual nº 10086, com base do Índice Ipardes de Desempenho Municipal, ano referencia 2021 (https://www.ipardes.pr.gov.br/Pagina/Indice-Ipardes-de-Desempenho-Municipal)"]
["1.6","O plano de trabalho deve ser preenchido, conforme Lei Federal- nº 14.133/2021 e Decreto Estadual nº 10086/2022."]
{"$rows_left_out":39}
{"sheet":"Plan2 1.DADOS,2.OBJ e 2.1.Vigên","index":1,"n_rows":47,"n_cols":13,"rows_kept":47,"cut":false,"hidden":false,"merged":[[33,1,33,3],[33,4,33,8],[1,2,1,8],[26,2,26,8],[27,2,27,3],[27,5,27,8],[22,2,22,8],[23,6,23,8],[23,2,23,3],[18,2,18,8],[19,2,19,8],[21,2,21,8],[20,6,20,8],[17,5,17,6],[6,2,6,8],[24,2,24,8],[7,2,7,8],[20,11,21,14],[13,2,13,8],[8,6,8,8],[8,2,8,4],[12,5,12,8],[11,2,11,8],[12,2,12,3],[9,6,9,8],[10,2,10,8],[45,1,45,2],[23,4,23,5],[17,7,17,8],[17,2,17,4],[41,1,41,8],[43,1,43,2],[37,1,37,3],[29,1,29,8],[34,1,34,3],[35,1,35,3],[30,1,31,8],[36,1,36,3],[37,4,37,8],[36,4,36,8],[35,4,35,8],[34,4,34,8]]}
[]
[null,null,"PROGRAMA ESTRADAS DA INTEGRAÇÃO  PROJETO DE PAVIMENTAÇÃO DE ESTRADAS\n RURAIS MUNICIPAIS"]
[]
[null,"1. DADOS CADASTRAIS "]
[null,"1.1 DO CONCEDENTE"]
[]
[null,"Secretaria","Secretaria da Agricultura e do Abastecimento"]
[null,"CNPJ:","76.416.957/0001-85"]
[null,"Endereço:","Rua dos Funcionários nº 1559, Cabral",null,null,"Município:","Curitiba"]
[null,"UF:","PR","CEP:","80035-050","Telefone:","(41) 3313-4000"]
{"$rows_left_out":38}
{"sheet":"Plan3 2.2. QUADRO RESUMO","index":2,"n_rows":20,"n_cols":13,"rows_kept":20,"cut":false,"hidden":false,"merged":[[19,1,21,12],[18,1,18,5],[17,1,17,5],[1,4,1,12],[3,1,3,12],[5,1,6,1],[5,2,6,2],[1,1,1,2],[5,11,6,11],[5,12,6,12],[5,6,6,6],[5,3,5,5],[5,7,6,7],[5,9,6,9],[5,8,6,8],[5,10,6,10]]}
[]
[null,null,null,null,"PROGRAMA ESTRADAS DA INTEGRAÇÃO  PROJETO DE PAVIMENTAÇÃO DE ESTRADAS\n RURAIS MUNICIPAIS"]
[]
[null,"2.2. Quadro Resumo (Total das Estradas Rurais/trechos indicados nos RTV*)"]
[]
[null,"nº","Estrada Rural/ Nome/ Trechos","Coordenadas UTM - DATUM SIRGAS\n2000 OU WGS84",null,null,"Extensão (m)","Larg. do Calçamento (m)","Largura conteção lateral\n(m)**","Largura cordão*** \n(m)**","Área de calçamento (m²)","Largura total (m)","Área a ser pavimentada total (m²)"]
[null,null,null,"FUSO","Início                        Lat./Long.","Término                       Lat./Long."]
[null,1,"XXXX",null,null,null,0,0,0,0,{"$f":"G8*H8","v":0},0,{"$f":"G8*L8","v":0}]
[null,2,null,null,null,null,null,null,null,null,{"$f":"G9*H9","v":0},{"$f":"H9+J9","v":0},{"$f":"G9*L9","v":0}]
[null,3,null,null,null,null,null,null,null,null,{"$f":"G10*H10","v":0},0,0]
{"$rows_left_out":11}
{"sheet":"Plan4 2.3. OPERAÇÕES","index":3,"n_rows":53,"n_cols":19,"rows_kept":53,"cut":false,"hidden":false,"merged":[[2,6,2,11],[4,1,5,12],[3,12,3,18],[44,3,44,11],[45,3,45,4],[43,1,43,11],[7,1,7,3],[8,2,8,3],[45,10,45,11],[7,11,9,11],[1,17,1,18],[1,12,2,14],[7,16,7,18],[2,17,2,18],[7,13,7,14],[5,17,5,18],[4,17,4,18],[4,13,4,14],[5,13,5,14],[46,3,47,3],[46,4,47,4],[46,5,47,5],[46,6,47,6],[8,17,8,18],[8,16,9,16],[46,7,46,8],[46,9,47,9],[46,10,47,10],[46,11,47,11],[7,12,9,12],[7,5,9,5],[7,6,9,6],[7,7,9,7],[7,8,7,10],[45,5,45,9]]}
[]
[null,null,null,null,null,null,null,null,null,null,null,null,"Contrapartida  ",null,null,"Municipio","IPDM","% DA CONTRAPARTDIDA"]
[null,null,null,null,null,null,"PROGRAMA ESTRADAS DA INTEGRAÇÃO  PROJETO DE PAVIMENTAÇÃO DE ESTRADAS\n RURAIS MUNICIPAIS",null,null,null,null,null,null,null,null,{"$f":"'Plan2 1.DADOS,2.OBJ e 2.1.Vigên'!C18","v":"Itapejara D'Oeste"},{"$f":"VLOOKUP(P3,Municipios!A:C,2,0)","v":0.79435927889054503},{"$f":"VALUE(VLOOKUP(Q3,Municipios!B:D,2,0))","v":0.1}]
[null,null,null,null,null,null,null,null,null,null,null,null,"Obs. : caso o municipio queira dar  uma contrapartida maior em um  único item deve ser feita de forma manual. A planilha, esta calculando automáticamente somente no financeiro."]
[null,"2.3. Operações a serem executadas nos trechos (Preferencialmente utilizar como referência: Tabelas de custos SEIL/DER/PR e, excepcionalmente, SINAPI E DNIT, nos casos de serviços não contemplados pela tabeLa do DER-PR",null,null,null,null,null,null,null,null,null,null,null,"SINAPI (MM/AAAA)",null,null,"DNIT (MM/AAAA)"]
[null,null,null,null,null,null,null,null,null,null,null,null,null,"DER/PR (MM/AAAA)",null,null,"Outros: (MM/AAAA)"]
[]
[null,"Tipo \nRevestimento:",null,null,{"$f":"'Plan2 1.DADOS,2.OBJ e 2.1.Vigên'!E35","v":"PAVIMENTO RÍGIDO DE CONCRETO"},"Unid.","Valor unitário (R$)¹","Qtd.","Custo Transp. (R$)",null,null,"Total s/ BDI (R$)","BDI % (material ou serviços)","Total c/ BDI (R$)",null,"SEAB","CONTRAPARTIDA (MUNICÍPIO)²"]
[null,null,"REFERENCIA",null,null,null,null,null,null,null,null,null,null,null,null,null,"FINANCEIRA R$","FÍSICA"]
[null,"Natureza de despesa","INSTITUIÇÃO","Código ","Itens",null,null,null,"QUANTIDADE (T)","UNITÁRIO","TOTAL",null,null,"Total c/ BDI (R$)","%","R$",null,"SERVIÇOS","BENS"]
{"$rows_left_out":44}
{"sheet":"Plan5 3. JUSTIFIC. e 4.BENEFIC.","index":4,"n_rows":31,"n_cols":7,"rows_kept":31,"cut":false,"hidden":false,"merged":[[29,1,29,3],[27,4,27,5],[29,4,29,5],[30,1,30,5],[21,1,21,3],[22,1,22,3],[23,1,23,3],[24,1,24,3],[25,1,25,3],[26,1,26,3],[27,1,27,3],[28,1,28,3],[11,1,11,3],[12,1,12,3],[13,1,13,3],[14,1,14,3],[15,1,15,3],[16,1,16,3],[17,1,17,3],[18,1,18,3],[19,1,19,3],[20,1,20,3],[1,3,1,5],[5,1,5,5],[1,1,1,2],[9,4,9,5],[9,1,10,3],[3,1,3,5]]}
[]
[null,null,null,"PROGRAMA ESTRADAS DA INTEGRAÇÃO                                   PROJETO DE PAVIMENTAÇÃO DE ESTRADAS\n RURAIS MUNICIPAIS"]
[]
[null,"3. RAZÕES PARA CELEBRAÇÃO - JUSTIFICATIVA"]
[]
[null,"1. Discorrer as razões que justificam a celebração do instrumento, caracterizando (evidenciando) e indicando, entre outras:\na) Descrever critérios técnico, para a escolha do tipo de pavimento a ser utilizado;\nb) Interesse recíprocos entre a Seab e o Município, e o atendimento da(s) necessidade (s) da comunidade (s) a serem benficiadas;\nc) relação entre a proposta apresentada, operações a serem executadas e objetivos do plano, programa, projeto ou proposta estadual ou municipal;\nd) qualificação do público alvo;\ne) problemas a serem resolvidos; \nf) resultados esperados;\n\n2. Demonstrar que os resultados (os benefícios para a coletividade) que se espera alcançar com a implantação do projeto serão muito maiores que as respectivas despesas (o recurso transferido somado à contrapartida). Equação “investimentos” versus “resultados” positiva.\n"]
[]
[null,"4. BENEFICIÁRIOS"]
[]
[null,"Nome da(s)  comunidade(s)",null,null,"Quantidade Usuários ( *)"]
{"$rows_left_out":22}
{"sheet":"Plan6 5.MET_FAS_ETA_CRON_6.METO","index":5,"n_rows":40,"n_cols":15,"rows_kept":40,"cut":false,"hidden":false,"merged":[[39,1,52,12],[37,1,37,12],[26,2,27,2],[26,1,27,1],[38,1,38,12],[30,1,30,12],[31,2,31,12],[32,2,32,12],[33,2,33,12],[34,2,34,12],[35,2,35,12],[16,12,23,12],[11,5,13,5],[9,1,9,2],[8,1,8,12],[9,4,10,4],[9,3,10,3],[14,1,23,1],[14,7,23,7],[14,8,23,8],[14,2,23,2],[9,5,9,6],[9,7,9,8],[16,11,23,11],[0,4,3,12],[14,9,23,9],[14,10,23,10],[9,9,9,10],[11,6,13,6],[11,7,13,7],[11,8,13,8],[11,9,13,9],[11,10,13,10],[9,11,10,11],[9,12,10,12],[5,1,5,12],[11,1,13,1],[11,2,13,2],[14,5,23,5],[14,6,23,6]]}
[null,null,null,null,"PROGRAMA ESTRADAS DA INTEGRAÇÃO                                  \nPROJETO DE PAVIMENTAÇÃO DE ESTRADAS\nRURAIS MUNICIPAIS"]
[]
[]
[]
[]
[null,"5. DEFINIÇÃO E DETALHAMENTO DAS METAS COM AS FASES E ETAPAS DE EXECUÇÃO E O CRONOGRAMA DE FISICO/ FINANCEIRO DA EXECUÇÃO A CONSIDERAR"]
[]
[]
[null,{"$f":"CONCATENATE(\"Meta: Melhoria da trafegabilidade, por meio da pavimentação de \",O10,\" m², com \",O9)","v":"Meta: Melhoria da trafegabilidade, por meio da pavimentação de 0,00 m², com PAVIMENTO RÍGIDO DE CONCRETO"},null,null,null,null,null,null,null,null,null,null,null,null,{"$f":"'Plan2 1.DADOS,2.OBJ e 2.1.Vigên'!E35","v":"PAVIMENTO RÍGIDO DE CONCRETO"}]
[null,"Fases",null,"Etapa","Especificação","Indicador Físico",null,"Custo (R$)",null,"Período de execução",null,"Responsável","Instrumentos de avaliação do cumprimento da fase ou etapa ",null,{"$f":"'Plan2 1.DADOS,2.OBJ e 2.1.Vigên'!L33","v":"0,00"}]
{"$rows_left_out":31}
{"sheet":"Plan7 7. PLA DE APL 8 Cap Int.","index":6,"n_rows":34,"n_cols":17,"rows_kept":34,"cut":false,"hidden":false,"merged":[[12,1,14,1],[8,4,8,5],[6,3,7,3],[6,2,7,2],[21,6,22,6],[19,2,19,9],[20,8,21,9],[20,5,20,7],[7,4,7,5],[23,8,23,9],[24,8,24,9],[20,4,22,4],[28,2,28,10],[29,2,29,10],[31,1,31,10],[27,8,27,9],[25,8,25,9],[26,8,26,9],[32,1,32,10],[33,1,37,10],[1,4,1,8],[6,6,6,8],[20,2,27,2],[6,9,7,9],[6,4,6,5],[15,4,15,5],[20,3,22,3],[21,7,22,7],[21,5,22,5],[12,4,12,8],[13,6,13,8],[13,4,14,5],[3,1,3,10],[22,8,22,9],[5,2,5,9]]}
[]
[null,null,null,null,"PROGRAMA ESTRADAS DA INTEGRAÇÃO  \nPROJETO DE PAVIMENTAÇÃO DE ESTRADAS\n RURAIS MUNICIPAIS"]
[]
[null,"7. PLANO DE APLICAÇÃO DOS RECURSOS e COM CRONOGRAMA DE DESEMBOLSO"]
[]
[null,null,"PLANO DE APLICAÇÃO DE RECURSOS - RESUMO DAS METAS ",null,null,null,null,null,null,null,null,null,null,null,null,"Pavimentação","Valor Base:"]
[null,null,"Descrição ","NATUREZA DE DESPESA","SEAB",null,"Contrapartida Município",null,null,"Valor Global - (R$)",null,null,null,null,null,{"$f":"'Plan2 1.DADOS,2.OBJ e 2.1.Vigên'!E35","v":"PAVIMENTO RÍGIDO DE CONCRETO"},{"$f":"VLOOKUP(P7,'Plan2 1.DADOS,2.OBJ e 2.1.Vigên'!L35:M41,2,0)","v":0}]
[null,null,null,null,"(R$)",null,"Financeira (R$)","Bens e/ou serviços (R$)","Total  (R$)"]
[null,null,"Contratação de empresa especializada para execução de 75.600m² de pavimentação com bloco sextavado","44.90.51.00",{"$f":"'Plan4 2.3. OPERAÇÕES'!E49","v":0},null,{"$f":"'Plan4 2.3. OPERAÇÕES'!G49","v":0},{"$f":"'Plan4 2.3. OPERAÇÕES'!H49+'Plan4 2.3. OPERAÇÕES'!I49","v":0},{"$f":"G9+H9","v":0},{"$f":"E9+I9","v":0}]
[]
{"$rows_left_out":25}
{"sheet":"Plan8 9_Parâmetro e 10-11-&","index":7,"n_rows":23,"n_cols":2,"rows_kept":23,"cut":false,"hidden":false,"merged":[[21,1,21,12],[5,1,5,12],[11,1,19,12],[22,1,36,12],[1,1,1,3],[1,5,1,12],[3,1,3,12],[10,1,10,12],[6,1,8,12]]}
[]
[]
[]
[]
[]
[null,"9. PARÂMETRO(S) PARA AFERIÇÃO DO CUMPRIMENTO DA META"]
[null,"Descrever a forma, modo, de avaliação dos resultados que permitirão a aferição dos resultados do convênio (ou seja, a conferência de seu objeto ter sido cumprido).\nConsiderar que para cada “problema” houve um modo, meio ou forma que o detectou ou o avaliou, sendo esse o parâmetro objetivo de avaliação.\n\nOs trechos serão classificados em Padrão A, B, C ou D, de acordo com sua condição atual, conforme os procedimentos para seleção. O cumprimento da meta será verificado pela mudança de Padrão, de acordo com a seguinte legenda:\n\n1. Padrão A: Estrada Rural com segmentos críticos, impedindo o tráfego contínuo em períodos prolongados do ano.\n2. Padrão B: Estrada Rural adequada, readequada ou melhorada, com conservação regular e pontos críticos que ainda impedem o tráfego contínuo em períodos sazonais.\n3. Padrão C: Estrada Rural adequada, readequada ou melhorada, com boa conservação, mas ainda com pontos críticos que impedem o tráfego contínuo em períodos esporádicos.\n4. Padrão D: Estrada Rural adequada, conservada, com práticas eficientes de conservação de solos e água, possibilitando o tráfego contínuo ao longo de todos os meses do ano.\n\nApós o preenchimento, deletar o texto em vermelho.\n"]
[]
[]
[]
{"$rows_left_out":14}
{"sheet":"Plan9 12. OBR_MONI_AVAL","index":8,"n_rows":17,"n_cols":3,"rows_kept":17,"cut":false,"hidden":false,"merged":[[1,2,1,11],[13,1,13,11],[16,1,16,11],[6,1,6,11],[15,1,15,11],[14,1,14,11],[10,1,10,11],[11,1,11,11],[12,1,12,11],[3,1,3,11],[5,1,5,11],[7,1,7,11],[8,1,8,11],[9,1,9,11],[4,1,4,11]]}
[]
[null,null,"PROGRAMA ESTRADAS DA INTEGRAÇÃO  PROJETO DE PAVIMENTAÇÃO DE ESTRADAS RURAIS MUNICIPAIS"]
[]
[null,"12. OBRIGAÇÕES"]
[null,"DO MONITORAMENTO, AVALIAÇÃO E DA PRESTAÇÃO DE CONTAS "]
[null,"1. O CONVENENTE TOMADOR realizará a prestação de contas através do Sistema Integrado de Transferências do TCE (SIT) conforme previsões das resoluções nº 28/2011, 46/2014 e a Instrução Normativa 61/2011 e as Cláusulas do Convênio"]
[null,"2.  Entregará ao fiscal da SEAB, cópia de ata da homologação do processo licitatório, contrato, CNO - Cadastro Nacional de Obras, licença ambiental do fornecedor ( pedreira)  do material a ser utilizado na pavimentação."]
[null,"3. O CONVENENTE TOMADOR, apresentará as informações dos resultados alcançados sob os aspectos técnicos e financeiros obtidos com a execução do objeto da parceria na seguinte forma e periodicidade:"]
[null,"3.1)    Bimestralmente, anualmente, e a cada liberação de parcela (R$) e após a Conclusão do Convênio  por meio de: "]
[null,"a.  Relatório de Execução do Objeto (PARCIAL E FINAL e a cada liberação de parcela): documento que descreverá as atividades desenvolvidas, comparativo das metas propostas e resultados alcançados, acompanhado do respectivo material comprobatório. ( mapas de medição e notas fiscais comprobatórias, CND da obra, fotos e filmagens). Obs.: será encaminhado junto com a solicitação de liberação de parcela."]
{"$rows_left_out":8}
{"sheet":"Plan10 13.DOC_INTEGR_PT ","index":9,"n_rows":24,"n_cols":6,"rows_kept":24,"cut":false,"hidden":false,"merged":[[3,1,3,3],[1,2,1,3],[4,1,4,3],[5,1,5,3],[6,1,6,3],[7,1,7,3],[8,1,8,3],[9,1,9,3],[10,1,10,3],[11,1,11,3],[12,1,12,3],[13,1,13,3],[14,1,14,3],[15,1,15,3],[16,1,16,3],[22,1,22,3],[23,1,23,3],[17,1,17,3],[18,1,18,3],[19,1,19,3],[20,1,20,3],[21,1,21,3]]}
[]
[null,null,"PROGRAMA ESTRADAS DA INTEGRAÇÃO  PROJETO DE PAVIMENTAÇÃO DE ESTRADAS  RURAIS MUNICIPAIS"]
[]
[null,"13. DOCUMENTOS INTEGRANTES DO PLANO DE TRABALHO "]
[null,"13.1 Descrição do Documento"]
[null,{"$f":"CONCATENATE(\"a) Declaração de Contrapartida (FISICA OU FINANCEIRA) no valor de R$ \", F6)","v":"a) Declaração de Contrapartida (FISICA OU FINANCEIRA) no valor de R$ 0,00"},null,null,null,{"$f":"TEXT('Plan4 2.3. OPERAÇÕES'!G49,\"#.##0,00\")","v":"0,00"}]
[null,"b) Orçamentos devidamente detalhado em planilha nos termos dos arts.368 a 372 e dos atrs. 484 a 486 do decreto Estadual 10.086/2022. Se forem com base em tabelas oficiais (DER-PR, SINAPE-PR, DNIT - SICRO,...amplamente divulgados em sitios eletronicos devidamente informados no memorial descritivo pagina de localização"]
[null,"C) Outros documentos necessários para execução do objeto (Caracterizar os documentos)"]
[]
[null,"13.2 PARA OBRAS OU SERVIÇOS DE ENGENHARIA E ARQUITETURA "]
{"$rows_left_out":15}
{"sheet":"Plan11  ASSINATURAS","index":10,"n_rows":38,"n_cols":15,"rows_kept":38,"cut":false,"hidden":false,"merged":[[18,2,18,7],[18,8,18,10],[1,3,1,10],[1,1,1,2],[3,1,3,10],[4,1,4,10],[5,2,5,7],[5,8,10,10],[6,2,6,7],[7,1,7,4],[7,5,7,7],[8,2,8,7],[9,2,9,7],[10,2,10,7],[11,2,11,7],[11,8,11,10],[13,1,13,10],[14,2,14,7],[14,8,17,10],[15,2,15,7],[16,2,16,7],[17,2,17,7],[22,1,22,10],[23,1,25,6],[26,1,26,6],[20,1,20,10],[21,1,21,10],[26,9,26,10],[37,1,37,6],[27,1,27,6],[30,1,30,10],[31,1,31,10],[33,1,34,6],[35,1,36,6],[36,9,36,10]]}
[]
[null,null,null,"PROGRAMA ESTRADAS DA INTEGRAÇÃO  PROJETO DE PAVIMENTAÇÃO DE ESTRADAS  RURAIS MUNICIPAIS"]
[]
[null,"14. RESPONSÁVEL TÉCNICO PELA ELABORAÇÃO DO PLANO DE TRABALHO"]
[null,{"$f":"CONCATENATE(N5,N6)","v":"O presente Plano de Trabalho foi por mim elaborado de acordo com as normas técnicas aplicáveis e está compatível com as prioridades de atendimento da agricultura familiar e com os recursos financeiros destinados pelo Projeto de Pavimentação com PAVIMENTO RÍGIDO DE CONCRETO"},null,null,null,null,null,null,null,null,null,null,null,"O presente Plano de Trabalho foi por mim elaborado de acordo com as normas técnicas aplicáveis e está compatível com as prioridades de atendimento da agricultura familiar e com os recursos financeiros destinados pelo Projeto de Pavimentação com "]
[null,"Nome:",null,null,null,null,null,null,"__________________________",null,null,null,null,{"$f":"'Plan2 1.DADOS,2.OBJ e 2.1.Vigên'!E35","v":"PAVIMENTO RÍGIDO DE CONCRETO"}]
[null,"Cargo:","ENGENHEIRO (a) CIVIL"]
[null,"N.º Registro Conselho de Classe:",null,null,null,"CREA PRXXXXX/D"]
[null,"Local:","XXXXXX"]
[null,"Nº telefone"]
{"$rows_left_out":29}
{"sheet":"Serviços","index":11,"n_rows":255,"n_cols":18,"rows_kept":255,"cut":false,"hidden":true,"merged":[[1,1,1,3],[1,13,1,14],[1,16,1,17],[1,8,1,10],[76,1,76,3],[76,13,76,14],[76,16,76,17],[39,1,39,3],[39,13,39,14],[39,16,39,17],[73,1,73,4],[110,1,110,4],[148,1,148,3],[148,8,148,10],[148,13,148,14],[148,16,148,17],[112,1,112,3],[112,13,112,14],[112,16,112,17],[220,1,220,3],[220,13,220,14],[220,16,220,17],[254,1,254,4],[182,1,182,4],[184,1,184,3],[184,8,184,10],[184,13,184,14],[184,16,184,17],[218,1,218,4]]}
[]
[null,"Tipo \nRevestimento:",null,null,"BLOCO SEXTAVADO",null,null,null,"Custo Transp. (R$)",null,null,null,null,"Total c/ BDI (R$)",null,"SEAB","CONTRAPARTIDA (MUNICÍPIO)²"]
[null,"Natureza de despesa","INTITUIÇÃO","Código","Itens","Unid.","Valor unitário (R$)¹","Qtd.","QUANTIDADE (T)","UNITÁRIO","TOTAL","Total s/ BDI (R$)","BDI %","Total c/ BDI (R$)","%","R$","FINANCEIRA R$","FÍSICA/SERVIÇOS"]
[null,"4.4.90.51.00","SINAPI",103689,"Placa de obra (para construção civil) em chapa galvanizada *n. 22*, adesivada, (3,00m x 1,50m)","m²",null,null,null,null,0,{"$f":"(G4*H4)+K4","v":0},null,{"$f":"IF(M4>0,L4+L4*M4,L4)","v":0},{"$f":"N4/N$35","v":{"$error":"#DIV/0!"}},{"$f":"N4-Q4-R4","v":0},{"$f":"L4*10%","v":0},0]
[null,"4.4.90.51.00","SINAPI",103694,"Suporte de madeira 3\"x3\" p/ placa DE OBRA","ud",null,null,null,null,0,{"$f":"(G5*H5)+K5","v":0},null,0,{"$error":"#DIV/0!"},0,0,0]
[null,"4.4.90.51.00","DER/PR",520100,"Escavação e carga mat. jazida 1a. cat. (reaterro)","m³",null,null,null,null,0,0,null,0,{"$error":"#DIV/0!"},0,0,0]
[null,"4.4.90.51.00","DER/PR",411000,"Esc. carga e transp. 1a. cat.(bota fora)","m³",null,null,null,null,0,0,null,0,{"$error":"#DIV/0!"},0,0,0]
[null,"4.4.90.51.00","DER/PR",511100,"Regularização compac.subleito 100% PN","m²",null,null,null,null,0,0,null,0,{"$error":"#DIV/0!"},0,0,0]
[null,"4.4.90.51.00","DER/PR",544000,"Solo cimento mist. pista (4%) 100% PN (Sub-Base 15 cm) .","m³",null,null,null,null,{"$f":"I9*J9","v":0},0,null,0,{"$error":"#DIV/0!"},0,0,0]
[null,"4.4.90.51.00","DER/PR",544000,"Solo cimento mist. pista (4%) 100% PN (Base 15 cm)","m³",null,null,null,null,{"$f":"I10*J10","v":0},0,null,0,{"$error":"#DIV/0!"},0,0,0]
{"$rows_left_out":246}
{"sheet":"Municipios","index":12,"n_rows":401,"n_cols":9,"rows_kept":401,"cut":false,"hidden":true,"merged":[]}
["Município","Índice IPARDES 2022","Contrapartida Mínima","Núcleo Regional","CNPJ","Credor","Endereço Prefeitura","Cep Prefeitura","Prefeito"]
["Abatiá",0.75557039609927878,{"$f":"IF(B2<0.5,\"1%\",(IF(B2<0.7,\"5%\",(IF(B2>0.7001,\"10%\",\"ERRADO\")))))","v":"10%"},"Cornélio Procópio","75.743.567/0001-57",214799,"Av. João Carvalho Mello, 135, Centro","86.460-000","Sonia Aparecida de Souza Chaves"]
["Adrianópolis",0.69505186206477942,{"$f":"IF(B3<0.5,\"1%\",(IF(B3<0.7,\"5%\",(IF(B3>0.7001,\"10%\",\"ERRADO\")))))","v":"5%"},"Curitiba","76.105.642/0001-17",102344,"Av. Marechal Mascarenhas de Morães, 115, Centr","83.490-000","Vandir de Oliveira Rosa"]
["Agudos do Sul",0.61475600286720866,"5%","Curitiba","76.105.667/0001-10",147555,"Av. Brasil, 38, Centro","83.850-000","Genezio Gonçalves da Luz"]
["Almirante Tamandaré",0.62592222354808857,"5%","Curitiba","76.105.659/0001-74",119789,"Av. Emílio Jonhson, 360, Centro","83.501-000","Camilo Daniel Lovato"]
["Altamira do Paraná",0.74494479954895543,"10%","Campo Mourão","78.069.143/0001-47",119790,"R. Cantú, 180, Centro","85.280-000","Elza Aparecida da Silva"]
["Alto Paraíso",0.75700084919073429,"10%","Umuarama","95.640.736/0001-30",119792,"Av. Pedro Amaro dos Santos, 900, Centro","87.528-000","Luiz Eliseu dos Santos"]
["Alto Paraná",0.68877462205909723,"5%","Paranavaí","76.279.967/0001-16",119793,"R. José Anchieta, 1641, Centro","87.750-000","Claudemir Joia Pereira"]
["Alto Piquiri",0.71459994843346364,"10%","Umuarama","76.247.352/0001-08",122329,"R. Santos Dumont, 341, Centro","87.580-000","Giovane Mendes de Carvalho"]
["Altônia",0.75920039754839908,"10%","Umuarama","81.478.059/0001-91",119791,"R. Rui Barbosa, 815, Centro","87.550-000","Diego Jardim Pergo"]
{"$rows_left_out":391}